{"text_format":"2","workbook":"xlsx","n_sheets":16,"sheets":["Scoring criteria","output 1","Feedback_output_1","Output 2","Feedback_output_2","Feedback_output_2 (2)","Output 3","Feedback_output_3","Calculation output 2","Calculation output 3","Calculation sheet","General_feedback","financial sheet","financial","Resume","SDscore"],"not_rendered":{"charts":63,"images":105,"macros":1,"external_links":1,"defined_names":10,"comments":2,"pivot_tables":0},"unopened":[],"bounds":{"document_bytes":16777216,"sheet_cells":100000,"run_cost":"one","rows_first":2000,"rows_last":500,"rows_between":2000,"halvings":0,"cell_chars":16384,"cell_head_chars":4096},"cells_cut":0,"cells_raw":0,"read":"whole","date_system":"1900"}

{"sheet":"Scoring criteria","index":0,"n_rows":195,"n_cols":8,"rows_kept":195,"cut":false,"hidden":false,"merged":[[15,6,15,7],[16,6,16,7],[17,6,17,7],[45,0,45,4],[0,0,0,7],[63,0,63,4],[130,0,130,4],[139,0,139,4],[82,0,82,4],[96,0,96,4],[108,0,108,4],[118,0,118,4],[20,0,20,4],[32,0,32,4],[11,6,11,7],[14,6,14,7],[26,6,26,7],[27,6,27,7],[28,6,28,7],[29,6,29,7],[30,6,31,7],[20,6,20,7],[18,6,19,7],[23,6,23,7],[24,6,24,7],[25,6,25,7],[39,6,39,7],[40,6,40,7],[41,6,41,7],[42,6,42,7],[43,6,44,7],[32,6,32,7],[35,6,35,7],[36,6,36,7],[37,6,37,7],[38,6,38,7],[52,6,52,7],[53,6,53,7],[54,6,54,7],[55,6,55,7],[56,6,56,7],[45,6,45,7],[48,6,48,7],[49,6,49,7],[50,6,50,7],[51,6,51,7],[63,6,63,7],[66,6,66,7],[67,6,67,7],[68,6,68,7],[69,6,69,7],[57,6,57,7],[58,6,58,7],[59,6,59,7],[60,6,60,7],[61,6,62,7],[75,6,75,7],[76,6,76,7],[77,6,77,7],[78,6,78,7],[79,6,79,7],[70,6,70,7],[71,6,71,7],[72,6,72,7],[73,6,73,7],[74,6,74,7],[102,6,102,7],[103,6,103,7],[88,6,88,7],[89,6,89,7],[90,6,90,7],[91,6,91,7],[92,6,92,7],[80,6,81,7],[82,6,82,7],[85,6,85,7],[86,6,86,7],[87,6,87,7],[191,3,191,4],[192,3,192,4],[4,0,6,0],[127,6,127,7],[128,6,129,7],[130,6,130,7],[133,6,133,7],[134,6,134,7],[122,6,122,7],[123,6,123,7],[124,6,124,7],[125,6,125,7],[126,6,126,7],[114,6,114,7],[115,6,115,7],[116,6,117,7],[118,6,118,7],[121,6,121,7],[106,6,107,7],[108,6,108,7],[111,6,111,7],[112,6,112,7],[113,6,113,7],[101,6,101,7],[135,6,135,7],[136,6,136,7],[137,6,138,7],[187,0,194,0],[194,3,194,4],[193,1,194,2],[156,0,156,3],[157,0,159,3],[160,0,162,3],[163,0,165,3],[166,0,168,3],[169,0,171,3],[172,0,174,3],[177,0,185,0],[177,1,179,3],[180,1,182,3],[183,1,185,3],[187,1,188,2],[187,3,187,4],[188,3,188,4],[189,1,190,2],[189,3,189,4],[190,3,190,4],[191,1,192,2],[139,6,139,7],[104,6,104,7],[105,6,105,7],[93,6,93,7],[94,6,95,7],[193,3,193,4],[96,6,96,7],[99,6,99,7],[100,6,100,7],[150,1,150,3],[151,1,151,3],[152,1,152,3],[153,1,153,3],[154,1,154,3],[142,5,142,7],[141,1,141,7],[142,1,142,3],[143,1,143,3],[144,1,144,3],[145,1,145,3],[146,1,146,3],[147,1,147,3],[148,1,148,3],[149,1,149,3]]}
["SNATtrop Scoring grid"]
["Date",null,null,null,"2011-07-29"]
["Name of the person in charge of questionnaires",{"$nulls":5},"Network"]
["Function ",{"$nulls":5},"Name","Function"]
["Persons who have implement the scoring",null,null,null,"n°1",null,"name"]
[{"$nulls":4},"n°2",null,"name"]
[{"$nulls":4},"n°3"]
["total number of persons",null,null,null,{"$f":"3-IF(ISBLANK(G5),1,0)-IF(ISBLANK(G6),1,0)-IF(ISBLANK(G7),1,0)","v":2}]
[]
[]
["NOTE: There is no link between the question nulbers below and the sections of the questionaire"]
["Sections and questions","N°1","N°2","N°3","Score\n(0 to 3) \nor NA","Scoring guide","Comments"]
[]
["Section 1: Objectives and context of surveillance",null,null,null,"Double click the icon to bring the scoring guide"]
["1.A           Relevance of surveillance objectives",3,3,null,{"$f":"IF(OR(AND(B15=\"NA\",C15=\"NA\",ISBLANK(D15)),AND(B15=\"NA\",C15=\"NA\",D15=\"NA\"),AND(B15=\"NA\",ISBLANK(C15),ISBLANK(D15))),\"NA\",SUM(B17:D17)/E$8)","v":3}]
["1.B           Level of detail, accuracy, and formalization of objectives",3,3,null,{"$f":"IF(OR(AND(B16=\"NA\",C16=\"NA\",ISBLANK(D16)),AND(B16=\"NA\",C16=\"NA\",D16=\"NA\"),AND(B16=\"NA\",ISBLANK(C16),ISBLANK(D16))),\"NA\",SUM(B16:D16)/E$8)","v":3}]
["1.C           Taking partners’ expectations into account",3,3,null,{"$f":"IF(OR(AND(B17=\"NA\",C17=\"NA\",ISBLANK(D17)),AND(B17=\"NA\",C17=\"NA\",D17=\"NA\"),AND(B17=\"NA\",ISBLANK(C17),ISBLANK(D17))),\"NA\",SUM(B17:D17)/E$8)","v":3}]
["1.D           Coherence of the diseases under surveillance with the sanitary situation (existing/exotic diseases or threats)",3,3,null,{"$f":"IF(OR(AND(B18=\"NA\",C18=\"NA\",ISBLANK(D18)),AND(B18=\"NA\",C18=\"NA\",D18=\"NA\"),AND(B18=\"NA\",ISBLANK(C18),ISBLANK(D18))),\"NA\",SUM(B18:D18)/E$8)","v":3}]
["Total",null,null,null,{"$f":"SUM(E15:E18)","v":12}]
["over",null,null,null,{"$f":"'Calculation sheet'!C14","v":12}]
["Comments / general recommendation"]
[]
["Section 2: Central institutional organization",null,null,null,"Double click the icon to bring the scoring guide"]
["2.A Existence of an operational management structure (central unit)",0,1,null,{"$f":"IF(OR(AND(B24=\"NA\",C24=\"NA\",ISBLANK(D24)),AND(B24=\"NA\",C24=\"NA\",D24=\"NA\"),AND(B24=\"NA\",ISBLANK(C24),ISBLANK(D24))),\"NA\",SUM(B24:D24)/E$8)","v":0.5}]
["2.B Existence of an operational steering structure that is representative of the partners (steering committee)",1,1,null,{"$f":"IF(OR(AND(B25=\"NA\",C25=\"NA\",ISBLANK(D25)),AND(B25=\"NA\",C25=\"NA\",D25=\"NA\"),AND(B25=\"NA\",ISBLANK(C25),ISBLANK(D25))),\"NA\",SUM(B25:D25)/E$8)","v":1}]
["2.C Existence of a scientific and technical committee for the system",2,2,null,2]
["2.D Organization and operations of the system laid down in regulations, a charter, or a convention established between the partners",0,0,null,0]
["2.E Frequency of meetings of the central coordinating body",2,2,null,2]
["2.F Supervision of intermediary units by the central level",2,2,null,2]
["2.G Adequacy of the central level’s material and financial resources  \n",0,0,null,0]
["Total",null,null,null,{"$f":"SUM(E24:E30)","v":7.5}]
["over",null,null,null,{"$f":"'Calculation sheet'!C23","v":21}]
["Comments/ general recommandation"]
[]
["Section 3: Field institutional organization",null,null,null,"Double click the icon to bring the scoring guide"]
["3.A Existence of formal intermediary units covering the entire territory",3,3,null,{"$f":"IF(OR(AND(B36=\"NA\",C36=\"NA\",ISBLANK(D36)),AND(B36=\"NA\",C36=\"NA\",D36=\"NA\"),AND(B36=\"NA\",ISBLANK(C36),ISBLANK(D36))),\"NA\",SUM(B36:D36)/E$8)","v":3}]
["3.B Active role of intermediary units in the functioning of the system (validation, management, feedback)",3,3,null,{"$f":"IF(OR(AND(B37=\"NA\",C37=\"NA\",ISBLANK(D37)),AND(B37=\"NA\",C37=\"NA\",D37=\"NA\"),AND(B37=\"NA\",ISBLANK(C37),ISBLANK(D37))),\"NA\",SUM(B37:D37)/E$8)","v":3}]
["3.C Implementation of supervision by the intermediary level\n",3,2.5,null,2.75]
["3.D Harmonization of intermediary units’ activities",0,0,null,0]
["3.E Adequacy of material and financial resources of intermediary units ",0,0,null,0]
["3.F Existence of coordination meetings at the intermediate level",1,3,null,2]
["3.G Exhaustiveness or representativeness of the field agents’ coverage of the target population",3,1,null,2]
["3.H Adequacy of material and financial resources at the field level ",0,0,null,0]
["Total",null,null,null,{"$f":"SUM(E36:E43)","v":12.75}]
["over",null,null,null,{"$f":"'Calculation sheet'!C33","v":24}]
["Comments/ general recommandation"]
[]
["Section 4 : Laboratory",null,null,null,"Double click the icon to bring the scoring guide"]
["4.A Effective integration of laboratories in the surveillance system",3,3,null,{"$f":"IF(OR(AND(B49=\"NA\",C49=\"NA\",ISBLANK(D49)),AND(B49=\"NA\",C49=\"NA\",D49=\"NA\"),AND(B49=\"NA\",ISBLANK(C49),ISBLANK(D49))),\"NA\",SUM(B49:D49)/E$8)","v":3}]
["4.B Adequacy of human, material, and financial resources for diagnostic needs",0,0,null,{"$f":"IF(OR(AND(B50=\"NA\",C50=\"NA\",ISBLANK(D50)),AND(B50=\"NA\",C50=\"NA\",D50=\"NA\"),AND(B50=\"NA\",ISBLANK(C50),ISBLANK(D50))),\"NA\",SUM(B50:D50)/E$8)","v":0}]
["4.C Application of Quality Assurance for the tests undertaken",3,3,null,3]
["4.D Quality of the standardization of work between different laboratories",3,3,null,3]
["4.E Proportion of tests submitted to inter-laboratory trials",3,3,null,3]
["4.F Existence of an investigation team to support field agents",2,2,null,2]
["4.G Relevance of diagnostic techniques",3,3,null,3]
["4.H Sensitivity of diagnostic techniques",0,3,null,1.5]
["4.I Specificity of diagnostic techniques",0,3,null,1.5]
["4.J Control of laboratory reagents",3,3,null,3]
["4.K Technical level of data management at the laboratory",0,3,null,1.5]
["4.L Analysis deadlines at the laboratory (formalization, standardization, verification, transfer of results to the central unit)",0,0,null,0]
["4.M Quality of results delivered",3,3,null,3]
["Total",null,null,null,{"$f":"SUM(E49:E61)","v":27.5}]
["Over",null,null,null,{"$f":"'Calculation sheet'!C48","v":39}]
["Comments/ general recommandation"]
[]
["Section 5: Surveillance tools",null,null,null,"Double click the icon to bring the scoring guide"]
["5.A Existence of a formalized surveillance protocol for each disease or threat under surveillance",2,2,null,{"$f":"IF(OR(AND(B67=\"NA\",C67=\"NA\",ISBLANK(D67)),AND(B67=\"NA\",C67=\"NA\",D67=\"NA\"),AND(B67=\"NA\",ISBLANK(C67),ISBLANK(D67))),\"NA\",SUM(B67:D67)/E$8)","v":2}]
["5.B Standardization of data collected",3,3,null,{"$f":"IF(OR(AND(B68=\"NA\",C68=\"NA\",ISBLANK(D68)),AND(B68=\"NA\",C68=\"NA\",D68=\"NA\"),AND(B68=\"NA\",ISBLANK(C68),ISBLANK(D68))),\"NA\",SUM(B68:D68)/E$8)","v":3}]
["5.C Relevance of measurement tools (excluding laboratory tools)",3,3,null,3]
["5.D Sensitivity of the case or threat definition",3,3,null,3]
["5.E Specificity of the case or threat definition",2,1,null,1.5]
["5.F Simplicity of the case or threat definition",2,2,null,2]
["5.G Quality of the filling out of investigation forms",3,3,null,3]
["5.H Relevance of collected  samples",3,2,null,2.5]
["5.I Standardization of collected samples",3,3,null,3]
["5.J Quality of samples collected",3,3,null,3]
["5.K Respect of the interval between the detection of a case or threat and the delivery of results",3,3,null,3]
["5.L Simplicity of the notification procedure",2,2,null,2]
["5.M Simplicity of the data collection procedure",2,3,null,2.5]
["5.N Acceptability of the consequences of a suspicion or case for the source or collector of data",2,1,null,1.5]
["Total",null,null,null,{"$f":"SUM(E67:E80)","v":35}]
["Over",null,null,null,{"$f":"'Calculation sheet'!C64","v":42}]
["Comments/ general recommandation"]
[]
["Section 6: Surveillance procedures",null,null,null,"Double click the icon to bring the scoring guide"]
["6.A Appropriateness of surveillance procedures with the system's objectives",0,0,null,{"$f":"IF(OR(AND(B86=\"NA\",C86=\"NA\",ISBLANK(D86)),AND(B86=\"NA\",C86=\"NA\",D86=\"NA\"),AND(B86=\"NA\",ISBLANK(C86),ISBLANK(D86))),\"NA\",SUM(B86:D86)/E$8)","v":0}]
["6.B Existence of passive (event-based) surveillance whose results are exhaustive or representative",3,3,null,{"$f":"IF(OR(AND(B87=\"NA\",C87=\"NA\",ISBLANK(D87)),AND(B87=\"NA\",C87=\"NA\",D87=\"NA\"),AND(B87=\"NA\",ISBLANK(C87),ISBLANK(D87))),\"NA\",SUM(B87:D87)/E$8)","v":3}]
["6.C Existence of awareness building programs for data sources in a passive (event-based) network ",2,2,null,2]
["6.D Relevance and suitability of active (planned) surveillance protocols ",1,1,null,1]
["6.E Surveillance of susceptible wild animals",0,0,null,0]
["6.F Vector surveillance and control","NA","NA",null,"NA"]
["6.G Representativeness of the populations targeted by sampling in active (planned) surveillance","NA","NA",null,"NA"]
["6.H Precision of sample under active (planned) surveillance","NA","NA",null,"NA"]
["6.I Level of satisfaction of active (planned) surveillance completeness rate","NA","NA",null,"NA"]
["Total",null,null,null,{"$f":"SUM(E86:E94)","v":6}]
["over",null,null,null,{"$f":"'Calculation sheet'!C75","v":27}]
["Comments/ general recommandation"]
[]
["Section 7: Data management",null,null,null,"Double click the icon to bring the scoring guide"]
["7.A. Adequacy of the data management system for the needs of the system (relational database, etc.)",3,3,null,{"$f":"IF(OR(AND(B100=\"NA\",C100=\"NA\",ISBLANK(D100)),AND(B100=\"NA\",C100=\"NA\",D100=\"NA\"),AND(B100=\"NA\",ISBLANK(C100),ISBLANK(D100))),\"NA\",SUM(B100:D100)/E$8)","v":3}]
["7.B Data input interval in accordance with the objectives and use of system results",0,0,null,{"$f":"IF(OR(AND(B101=\"NA\",C101=\"NA\",ISBLANK(D101)),AND(B101=\"NA\",C101=\"NA\",D101=\"NA\"),AND(B101=\"NA\",ISBLANK(C101),ISBLANK(D101))),\"NA\",SUM(B101:D101)/E$8)","v":0}]
["7.C. Designated staff available and trained in data entry, management and analysis.",1,1,null,1]
["7.D. Adequacy of material and financial resources for data management and analysis",0,0,null,0]
["7.E. Data verification and validation procedures formalized and operational",0,2,null,1]
["7.F Complete descriptive processing of data",3,3,null,3]
["7.G. Exploitation of data fits the needs of the system (if possible regular and multi-disciplinary)",0,0,null,0]
["Total",null,null,null,{"$f":"SUM(E100:E106)","v":8}]
["Over",null,null,null,{"$f":"'Calculation sheet'!C84","v":21}]
["Comments/ general recommandation"]
[]
["Section 8: Training",null,null,null,"Double click the icon to bring the scoring guide"]
["8.A. Adequate skill level in epidemiology of members of the central unit",1,1,null,{"$f":"IF(OR(AND(B112=\"NA\",C112=\"NA\",ISBLANK(D112)),AND(B112=\"NA\",C112=\"NA\",D112=\"NA\"),AND(B112=\"NA\",ISBLANK(C112),ISBLANK(D112))),\"NA\",SUM(B112:D112)/E$8)","v":1}]
["8.B. Initial training implemented for all field agents when joining the system",1,1,null,{"$f":"IF(OR(AND(B113=\"NA\",C113=\"NA\",ISBLANK(D113)),AND(B113=\"NA\",C113=\"NA\",D113=\"NA\"),AND(B113=\"NA\",ISBLANK(C113),ISBLANK(D113))),\"NA\",SUM(B113:D113)/E$8)","v":1}]
["8.C. Objectives and contents of initial training of system field actors adequate for operational surveillance needs",3,2,null,2.5]
["8.D. Regular advanced training",0,0,null,0]
["8.E. Adequacy of material and financial resources for training",1,1,null,1]
["Total",null,null,null,{"$f":"SUM(E112:E116)","v":5.5}]
["Over",null,null,null,{"$f":"'Calculation sheet'!C91","v":15}]
["Comments/ general recommandation"]
[]
["Section 9 : Communication",null,null,null,"Double click the icon to bring the scoring guide"]
["9.A Regular release of reports and scientific articles on surveillance results",0,0,null,{"$f":"IF(OR(AND(B122=\"NA\",C122=\"NA\",ISBLANK(D122)),AND(B122=\"NA\",C122=\"NA\",D122=\"NA\"),AND(B122=\"NA\",ISBLANK(C122),ISBLANK(D122))),\"NA\",SUM(B122:D122)/E$8)","v":0}]
["9.B. Return of individual test results to field actors",3,3,null,{"$f":"IF(OR(AND(B123=\"NA\",C123=\"NA\",ISBLANK(D123)),AND(B123=\"NA\",C123=\"NA\",D123=\"NA\"),AND(B123=\"NA\",ISBLANK(C123),ISBLANK(D123))),\"NA\",SUM(B123:D123)/E$8)","v":3}]
["9.C. Regular dissemination of a relevant information bulletin",3,0,null,1.5]
["9.D. Systematic return of reports on results to field actors (outside of a bulletin). ",3,3,null,3]
["9.E. Presence of a communications system organized transversally and vertically between field actors (mail, web, telephone…)",3,3,null,3]
["9.F. Solid external communication policy",3,3,null,3]
["9.G. Adequacy of material and financial resources for communication",0,0,null,0]
["Total",null,null,null,{"$f":"SUM(E122:E128)","v":13.5}]
["Sur",null,null,null,{"$f":"'Calculation sheet'!C100","v":21}]
["Commentaire / recommandation générale"]
[]
["Section 10 : Evaluation",null,null,null,"Double click the icon to bring the scoring guide"]
["10.A. System of performance indicators developed and validated by the directors of the network.",0,0,null,{"$f":"IF(OR(AND(B134=\"NA\",C134=\"NA\",ISBLANK(D134)),AND(B134=\"NA\",C134=\"NA\",D134=\"NA\"),AND(B134=\"NA\",ISBLANK(C134),ISBLANK(D134))),\"NA\",SUM(B134:D134)/E$8)","v":0}]
["10.B. Performance indicators regularly measured, interpreted, and disseminated","NA",0,null,{"$f":"IF(OR(AND(B135=\"NA\",C135=\"NA\",ISBLANK(D135)),AND(B135=\"NA\",C135=\"NA\",D135=\"NA\"),AND(B135=\"NA\",ISBLANK(C135),ISBLANK(D135))),\"NA\",SUM(B135:D135)/E$8)","v":0}]
["10.C. External evaluations carried out",1,1,null,1]
["10.D. Implementation of corrective measures",1,1,null,1]
["Total",null,null,null,{"$f":"SUM(E134:E137)","v":2}]
["Sur",null,null,null,{"$f":"'Calculation sheet'!C106","v":12}]
["Commentaire / recommandation générale"]
[]
["Section 11 : Global Evaluation","Complete by the evaluator"]
["11.A. Number of missing answers",2,null,null,{"$f":"B143","v":2}]
["11.B. Heterogeneity of answers of the intermediary units : number of answers Very homogeneous",32,null,null,{"$f":"IF(AND(B144=\"NA\"),\"NA\",B144)","v":32}]
["11.B. Heterogeneity of answers of the intermediary units : number of answers fairly homogeneous","NA",null,null,{"$f":"IF(AND(B145=\"NA\"),\"NA\",B145)","v":"NA"}]
["11.B. Heterogeneity of answers of the intermediary units : number of answers Not homogeneous but homogeneous for one category of actors","NA",null,null,"NA"]
["11.B. Heterogeneity of answers of the intermediary units : number of answers Not homogeneous",6,null,null,6]
["11.C. Heterogeneity of answers of the field agents : number of answers Very homogeneous",29,null,null,29]
["11.C. Heterogeneity of answers of the field agents : number of answers fairly homogeneous",8,null,null,8]
["11.C. Heterogeneity of answers of the field agents : number of answers Not homogeneous but homogeneous for one category of actors","NA",null,null,"NA"]
["11.C. Heterogeneity of answers of the field agents : number of answers Not homogeneous",6,null,null,6]
["11.D. Heterogeneity of answers of the laboratories : number of answers Very homogeneous","NA",null,null,"NA"]
["11.D. Heterogeneity of answers of the laboratories : number of answers fairly homogeneous","NA",null,null,"NA"]
["11.D. Heterogeneity of answers of the laboratories : number of answers Not homogeneous but homogeneous for one category of actors","NA",null,null,"NA"]
["11.D. Heterogeneity of answers of the laboratories : number of answers Not homogeneous","NA",null,null,"NA"]
[]
["Section: financial contributions                                                                                                                                               Note: if you have no end date of funding enter the date of the assessment and add its 10 years",null,null,null,"financial\ncontributions in dollars  allocated per year (one line per partner) \n","End date of funding (day/month/year)","Percentage of financial\ncontributions \n"]
["a. Central unit",{"$nulls":5},{"$f":"IF(SUM(E158:E160)<>0,E158/SUM(E158:E160),0)","v":0}]
[{"$nulls":6},{"$f":"IF(SUM(E158:E160)<>0,E159/SUM(E158:E160),0)","v":0}]
[{"$nulls":6},{"$f":"IF(SUM(E158:E160)<>0,E160/SUM(E158:E160),0)","v":0}]
["c. Laboratories",{"$nulls":5},{"$f":"IF(SUM(E161:E163)<>0,E161/SUM(E161:E163),0)","v":0}]
[{"$nulls":6},{"$f":"IF(SUM(E161:E163)<>0,E162/SUM(E161:E163),0)","v":0}]
[{"$nulls":6},{"$f":"IF(SUM(E161:E163)<>0,E163/SUM(E161:E163),0)","v":0}]
["d. Passive surveillance",{"$nulls":5},{"$f":"IF(SUM(E164:E166)<>0,E164/SUM(E164:E166),0)","v":0}]
[{"$nulls":6},{"$f":"IF(SUM(E164:E166)<>0,E165/SUM(E164:E166),0)","v":0}]
[{"$nulls":6},{"$f":"IF(SUM(E164:E166)<>0,E166/SUM(E164:E166),0)","v":0}]
["e. Active surveillance",{"$nulls":5},{"$f":"IF(SUM(E167:E169)<>0,E167/SUM(E167:E169),0)","v":0}]
[{"$nulls":6},{"$f":"IF(SUM(E167:E169)<>0,E168/SUM(E167:E169),0)","v":0}]
[{"$nulls":6},{"$f":"IF(SUM(E167:E169)<>0,E169/SUM(E167:E169),0)","v":0}]
["f. Specific surveillance",{"$nulls":5},{"$f":"IF(SUM(E170:E172)<>0,E170/SUM(E170:E172),0)","v":0}]
[{"$nulls":6},{"$f":"IF(SUM(E170:E172)<>0,E171/SUM(E170:E172),0)","v":0}]
[{"$nulls":6},{"$f":"IF(SUM(E170:E172)<>0,E172/SUM(E170:E172),0)","v":0}]
["g. Evaluation",{"$nulls":5},{"$f":"IF(SUM(E173:E175)<>0,E173/SUM(E173:E175),0)","v":0}]
[{"$nulls":6},{"$f":"IF(SUM(E173:E175)<>0,E174/SUM(E173:E175),0)","v":0}]
[{"$nulls":6},{"$f":"IF(SUM(E173:E175)<>0,E175/SUM(E173:E175),0)","v":0}]
[]
[{"$nulls":4},"Percentage of processed data (one line per person)","End date of contract (day/month/year)\n"]
["h. Data management","Persons in charge of data entry"]
[]
[]
[null,"Persons in charge of data validation"]
[]
[]
[null,"Persons in charge of data analysis"]
[]
[]
[]
["Number of people who has been interviewed","field agents",null,"active and passive surveillance",null,0]
[null,null,null,"only passive surveillance",null,5]
[null,"intermediary units - supervision of field agents",null,"active and passive surveillance",null,0]
[null,null,null,"only passive surveillance",null,3]
[null,"Central Unit",null,"Coordinator",null,1]
[null,null,null,"Other",null,1]
[null,"Laboratories",null,"Central laboratory",null,1]
[null,null,null,"Local laboratories",null,"NA"]

{"sheet":"output 1","index":1,"n_rows":15,"n_cols":10,"rows_kept":15,"cut":false,"hidden":false,"merged":[[1,0,1,2],[0,0,0,2],[3,4,3,9]]}
["SNATtrop"]
["Graphical output 1"]
[]
[{"$nulls":4},"Evolution with Financial contributions"]
["Sections","Result of evaluation per each section","Percentage of satisfaction ",null,"6 month later","% of satisfaction","1 year later","% of satisfaction","2 years later","% of satisfaction"]
[{"$f":"'Scoring criteria'!A14","v":"Section 1: Objectives and context of surveillance"},null,{"$f":"('Scoring criteria'!E19/'Scoring criteria'!E20)","v":1},null,null,{"$f":"C6","v":1},null,{"$f":"C7","v":0.35714285714285715},null,{"$f":"C7","v":0.35714285714285715}]
[{"$f":"'Scoring criteria'!A23","v":"Section 2: Central institutional organization"},null,{"$f":"('Scoring criteria'!E31/'Scoring criteria'!E32)","v":0.35714285714285715},null,null,{"$f":"'financial sheet'!G24","v":0.35714285714285715},null,{"$f":"'financial sheet'!G25","v":0.35714285714285715},null,{"$f":"'financial sheet'!G26","v":0.35714285714285715}]
[{"$f":"'Scoring criteria'!A35","v":"Section 3: Field institutional organization"},null,{"$f":"('Scoring criteria'!E44/'Scoring criteria'!E45)","v":0.53125},null,null,{"$f":"'financial sheet'!G36","v":0.53125},null,{"$f":"'financial sheet'!G37","v":0.53125},null,{"$f":"'financial sheet'!G38","v":0.53125}]
[{"$f":"'Scoring criteria'!A48","v":"Section 4 : Laboratory"},null,{"$f":"('Scoring criteria'!E62/'Scoring criteria'!E63)","v":0.70512820512820518},null,null,{"$f":"'financial sheet'!G53","v":0.70512820512820518},null,{"$f":"'financial sheet'!G54","v":0.70512820512820518},null,{"$f":"'financial sheet'!G55","v":0.70512820512820518}]
[{"$f":"'Scoring criteria'!A66","v":"Section 5: Surveillance tools"},null,{"$f":"('Scoring criteria'!E81/'Scoring criteria'!E82)","v":0.83333333333333337},null,null,{"$f":"'financial sheet'!G71","v":0.83333333333333337},null,{"$f":"'financial sheet'!G72","v":0.83333333333333337},null,{"$f":"'financial sheet'!G73","v":0.83333333333333337}]
[{"$f":"'Scoring criteria'!A85","v":"Section 6: Surveillance procedures"},null,{"$f":"('Scoring criteria'!E95/'Scoring criteria'!E96)","v":0.22222222222222221},null,null,{"$f":"'financial sheet'!G84","v":0.4},null,{"$f":"'financial sheet'!G85","v":0.4},null,{"$f":"'financial sheet'!G86","v":0.4}]
[{"$f":"'Scoring criteria'!A99","v":"Section 7: Data management"},null,{"$f":"('Scoring criteria'!E107/'Scoring criteria'!E108)","v":0.38095238095238093},null,null,{"$f":"'financial sheet'!G95","v":0.38095238095238093},null,{"$f":"'financial sheet'!G96","v":0.38095238095238093},null,{"$f":"'[1]financial sheet'!G99","v":0}]
["Section 8 : Formation",null,{"$f":"('Scoring criteria'!E117/'Scoring criteria'!E118)","v":0.36666666666666664},null,null,{"$f":"'financial sheet'!G104","v":0.36666666666666664},null,{"$f":"'financial sheet'!G105","v":0.36666666666666664},null,{"$f":"'financial sheet'!G106","v":0.36666666666666664}]
["Section 9 : Communication",null,{"$f":"('Scoring criteria'!E129/'Scoring criteria'!E130)","v":0.6428571428571429},null,null,{"$f":"'financial sheet'!G115","v":0.6428571428571429},null,{"$f":"'financial sheet'!G116","v":0.6428571428571429},null,{"$f":"'financial sheet'!G117","v":0.6428571428571429}]
["Section 10 : Evaluation",null,{"$f":"('Scoring criteria'!E138/'Scoring criteria'!E139)","v":0.16666666666666666},null,null,{"$f":"'financial sheet'!G123","v":0.16666666666666666},null,{"$f":"'financial sheet'!G124","v":0.16666666666666666},null,{"$f":"'financial sheet'!G125","v":0.16666666666666666}]

{"sheet":"Feedback_output_1","index":2,"n_rows":100,"n_cols":3,"rows_kept":100,"cut":false,"hidden":false,"merged":[[0,0,0,1],[1,0,1,1]]}
["Feedback per section (for output 1)"]
["To get started click to classify the criteria. For each section, the criteria used are classified according to their score. In each table the first criteria are the most poorly rated."]
[]
["Section 1","Score","Referencing question"]
["1.D  Coherence of the diseases under surveillance with the sanitary situation (existing/exotic diseases or threats)",{"$f":"'Scoring criteria'!E18","v":3},"Section 1 question 3"]
["1.C  Taking partners’ expectations into account",{"$f":"'Scoring criteria'!E17","v":3},"Section 1 question 4"]
["1.B  Level of detail, accuracy, and formalization of objectives",{"$f":"'Scoring criteria'!E16","v":3},"Section 1 question 1 and 2"]
["1.A   Relevance of surveillance objectives",{"$f":"'Scoring criteria'!E15","v":3},"Section 1 question 1 and 3"]
[]
["Section 2","Score","Referencing question"]
["2.G Adequacy of the central level’s material and financial resources  \n",{"$f":"'Scoring criteria'!E30","v":0},"Section 2 question 23, 26, 40 and 55 "]
["2.D Organization and operations of the system laid down in regulations, a charter, or a convention established between the partners",{"$f":"'Scoring criteria'!E27","v":0},"Section 2 question 57, 58 and 59"]
["2.A Existence of an operational management structure (central unit)",{"$f":"'Scoring criteria'!E24","v":0.5},"Section 2 question 7, 9, 10, 20 and 22"]
["2.B Existence of an operational steering structure that is representative of the partners (steering committee)",{"$f":"'Scoring criteria'!E25","v":1},"Section 2 question 28/29, 31, 34, 37, 38 and 39"]
["2.F Supervision of intermediary units by the central level",{"$f":"'Scoring criteria'!E29","v":2},"Section 2 question 68, 70 and 73"]
["2.C Existence of a scientific and technical committee for the system",{"$f":"'Scoring criteria'!E26","v":2},"Section 2 question 41, 45, 46, 48, 52 and 54"]
["2.E Frequency of meetings of the central coordinating body",{"$f":"'Scoring criteria'!E28","v":2},"Section 2 question 61, 62, 65 and 67"]
[]
["Section 3","Score","Referencing question"]
["3.D Harmonization of intermediary units’ activities",{"$f":"'Scoring criteria'!E39","v":0},"section 3 (part 1) question 12, 13 and 14"]
["3.E Adequacy of material and financial resources of intermediary units ",{"$f":"'Scoring criteria'!E40","v":0},"Section 3 (part 2) question 2, 3 and 4"]
["3.H Adequacy of material and financial resources at the field level ",{"$f":"'Scoring criteria'!E43","v":0},"Section 3 (part 3) question  4, 5 and 6"]
["3.F Existence of coordination meetings at the intermediate level",{"$f":"'Scoring criteria'!E41","v":2},"Section 3 (part 1) question 18, 21, 28, 30 and 32"]
["3.G Exhaustiveness or representativeness of the field agents’ coverage of the target population",{"$f":"'Scoring criteria'!E42","v":2},"Section 3 (part 2) question 10, 14 and 16"]
["3.C Implementation of supervision by the intermediary level\n",{"$f":"'Scoring criteria'!E38","v":2.75},"Section 3 (part 2) question 5, 7 and 9"]
["3.A Existence of formal intermediary units covering the entire territory",{"$f":"'Scoring criteria'!E36","v":3},"Section 3 (part 1) question 1, 8 and 5"]
["3.B Active role of intermediary units in the functioning of the system (validation, management, feedback)",{"$f":"'Scoring criteria'!E37","v":3},"Section 3 (part 2) question 1"]
[]
["Section 4","Score","Referencing question"]
["4.B Adequacy of human, material, and financial resources for diagnostic needs",{"$f":"'Scoring criteria'!E50","v":0},"Section 4 question 8, 9, 10, 35, 36 and 37"]
["4.L Analysis deadlines at the laboratory (formalization, standardization, verification, transfer of results to the central unit)",{"$f":"'Scoring criteria'!E60","v":0},"Section 4 table at the end of the section column j and k and question 20 and 47"]
["4.H Sensitivity of diagnostic techniques",{"$f":"'Scoring criteria'!E56","v":1.5},"Section 4 table at the end of the section column b"]
["4.I Specificity of diagnostic techniques",{"$f":"'Scoring criteria'!E57","v":1.5},"Section 4 table at the end of the section column c"]
["4.K Technical level of data management at the laboratory",{"$f":"'Scoring criteria'!E59","v":1.5},"Section 4 question 15, 18 and 45"]
["4.F Existence of an investigation team to support field agents",{"$f":"'Scoring criteria'!E54","v":2},"Section 4 question 52 and 53"]
["4.D Quality of the standardization of work between different laboratories",{"$f":"'Scoring criteria'!E52","v":3},"Section 4 question 3, 21, 48 and 49"]
["4.G Relevance of diagnostic techniques",{"$f":"'Scoring criteria'!E55","v":3},"Section 4 question 54, 55 "]
["4.A Effective integration of laboratories in the surveillance system",{"$f":"'Scoring criteria'!E49","v":3},"Section 4 question 1 and 2"]
["4.C Application of Quality Assurance for the tests undertaken",{"$f":"'Scoring criteria'!E51","v":3},"section 4 table at the end of the section column l"]
["4.E Proportion of tests submitted to inter-laboratory trials",{"$f":"'Scoring criteria'!E53","v":3},"Section 4 table at the end of the section column m"]
["4.J Control of laboratory reagents",{"$f":"'Scoring criteria'!E58","v":3},"Section 4 question 23 and 51"]
["4.M Quality of results delivered",{"$f":"'Scoring criteria'!E61","v":3},"Section 4 question 58 and 59"]
[]
["Section 5","Score","Referencing question"]
["5.E Specificity of the case or threat definition",{"$f":"'Scoring criteria'!E71","v":1.5},"Section 5 question 17"]
["5.N Acceptability of the consequences of a suspicion or case for the source or collector of data",{"$f":"'Scoring criteria'!E80","v":1.5},"section 5 (part 3) question 21 and 22"]
["5.A Existence of a formalized surveillance protocol for each disease or threat under surveillance",{"$f":"'Scoring criteria'!E67","v":2},"Section 5 (part 1) question 1 and 2 to 13"]
["5.F Simplicity of the case or threat definition",{"$f":"'Scoring criteria'!E72","v":2},"Section 5 (part 2 and 3)  question 1"]
["5.L Simplicity of the notification procedure",{"$f":"'Scoring criteria'!E78","v":2},"Section 5 (part 1) question 36, section 5 (part 2) question 16, 4 and 15 and Section 5 (part 3) question 7, 19 and 20"]
["5.H Relevance of collected  samples",{"$f":"'Scoring criteria'!E74","v":2.5},"Section 5 (part 1) question 24, Section 5 (part 2) question 9 Section 5 (part 3) Quesstion 14 section 1 question 1 and 3"]
["5.M Simplicity of the data collection procedure",{"$f":"'Scoring criteria'!E79","v":2.5},"Section 5 (part 2) question 12, 17, 7, 8 and section 5 (part 3) question 16, 10, 14, 11, and 15"]
["5.B Standardization of data collected",{"$f":"'Scoring criteria'!E68","v":3},"Section 5 (part 1) question 14, 19, 20, 22 and 23"]
["5.C Relevance of measurement tools (excluding laboratory tools)",{"$f":"'Scoring criteria'!E69","v":3},"Section 5 (part 2) question 6, Section 5 (part 3) question 9 and section 1 question 1 "]
["5.D Sensitivity of the case or threat definition",{"$f":"'Scoring criteria'!E70","v":3},"Section 5 (part 1) question 16"]
["5.G Quality of the filling out of investigation forms",{"$f":"'Scoring criteria'!E73","v":3},"Section 5 (part 1) question 19 and 21"]
["5.I Standardization of collected samples",{"$f":"'Scoring criteria'!E75","v":3},"Section 5 (part 1) question 25 and 26"]
["5.J Quality of samples collected",{"$f":"'Scoring criteria'!E76","v":3},"Section 5 (part 1) question 28"]
["5.K Respect of the interval between the detection of a case or threat and the delivery of results",{"$f":"'Scoring criteria'!E77","v":3},"Section 5 (part 1) question31, 32, 33 and 34"]
[]
["Section 6","Score","Referencing question"]
["6.A Appropriateness of surveillance procedures with the system's objectives",{"$f":"'Scoring criteria'!E86","v":0},"Section 5 (part 1) question 50, 48 and 49"]
["6.E Surveillance of susceptible wild animals",{"$f":"'Scoring criteria'!E90","v":0},"Section 5 (part 1) qestion 44 and section (part 3) question 35 and 36"]
["6.D Relevance and suitability of active (planned) surveillance protocols ",{"$f":"'Scoring criteria'!E89","v":1},"Section 5 (part 1) question 40, 42 and 41"]
["6.C Existence of awareness building programs for data sources in a passive (event-based) network ",{"$f":"'Scoring criteria'!E88","v":2},"Section 5 (part 1) question 61 and section 5 (part 3) question 23, 24 and 37"]
["6.B Existence of passive (event-based) surveillance whose results are exhaustive or representative",{"$f":"'Scoring criteria'!E87","v":3},"Section 5 (part 1) question 16 and 38"]
["6.F Vector surveillance and control",{"$f":"'Scoring criteria'!E91","v":"NA"},"Section 5 (part 1) question 46 and section 5 (part 3) question 37 and 38"]
["6.G Representativeness of the populations targeted by sampling in active (planned) surveillance",{"$f":"'Scoring criteria'!E92","v":"NA"},"Section 5 (part 1) question 33 and section 5 (part 3) question 29"]
["6.H Precision of sample under active (planned) surveillance",{"$f":"'Scoring criteria'!E93","v":"NA"},"Section 3 (part 1) question 31, section 3 (part 3) question 2  section 4 table at the end of the section column b and c"]
["6.I Level of satisfaction of active (planned) surveillance completeness rate",{"$f":"'Scoring criteria'!E94","v":"NA"},"Section 5 (part 3) question 33 and 34"]
[]
["Section 7 ","Score","Referencing question"]
["7.B Data input interval in accordance with the objectives and use of system results",{"$f":"'Scoring criteria'!E101","v":0},"Section 7 question 18"]
["7.D. Adequacy of material and financial resources for data management and analysis",{"$f":"'Scoring criteria'!E103","v":0},"Section 7 question 28, 50 and 51"]
["7.G. Exploitation of data fits the needs of the system (if possible regular and multi-disciplinary)",{"$f":"'Scoring criteria'!E106","v":0},"Section 7 question 31, 33 and 34"]
["7.C. Designated staff available and trained in data entry, management and analysis.",{"$f":"'Scoring criteria'!E102","v":1},"Section 7 question 52"]
["7.E. Data verification and validation procedures formalized and operational",{"$f":"'Scoring criteria'!E104","v":1},"Section 7 question 25, 26 and 27"]
["7.A. Adequacy of the data management system for the needs of the system (relational database, etc.)",{"$f":"'Scoring criteria'!E100","v":3},"Section 7 question 3, 8 and 9 "]
["7.F Complete descriptive processing of data",{"$f":"'Scoring criteria'!E105","v":3},"Section 7 question 36, 37, 38, 40 and 49"]
[]
["Section 8 ","Score","Referencing question"]
["8.D. Regular advanced training",{"$f":"'Scoring criteria'!E115","v":0},"Section 8 question 14 and 20"]
["8.B. Initial training implemented for all field agents when joining the system",{"$f":"'Scoring criteria'!E113","v":1},"Section 8 question 9 and 10"]
["8.A. Adequate skill level in epidemiology of members of the central unit",{"$f":"'Scoring criteria'!E112","v":1},"Section 8 question 2 and 4"]
["8.E. Adequacy of material and financial resources for training",{"$f":"'Scoring criteria'!E116","v":1},"Section 8 question 19"]
["8.C. Objectives and contents of initial training of system field actors adequate for operational surveillance needs",{"$f":"'Scoring criteria'!E114","v":2.5},"Section 8 question 11"]
[]
["Section 9","Score","Referencing question "]
["9.A Regular release of reports and scientific articles on surveillance results",{"$f":"'Scoring criteria'!E122","v":0},"Section 9 question 9, 10 and 11"]
["9.G. Adequacy of material and financial resources for communication",{"$f":"'Scoring criteria'!E128","v":0},"Section 9 question 42, 43 and 44"]
["9.C. Regular dissemination of a relevant information bulletin",{"$f":"'Scoring criteria'!E124","v":1.5},"Section 9 question 33, 34, 35, 36 and 40"]
["9.B. Return of individual test results to field actors",{"$f":"'Scoring criteria'!E123","v":3},"Section 9 question 14"]
["9.D. Systematic return of reports on results to field actors (outside of a bulletin). ",{"$f":"'Scoring criteria'!E125","v":3},"Section 9 question 25 and 26"]
["9.E. Presence of a communications system organized transversally and vertically between field actors (mail, web, telephone…)",{"$f":"'Scoring criteria'!E126","v":3},"Section 9 question 13 and 16 "]
["9.F. Solid external communication policy",{"$f":"'Scoring criteria'!E127","v":3},"Section 9 question 24 and 32"]
[]
["Section 10","Score","Referencing question"]
["10.B. Performance indicators regularly measured, interpreted, and disseminated",{"$f":"'Scoring criteria'!E135","v":0},"Section 10 question 6, 7, 9 and 10"]
["10.A. System of performance indicators developed and validated by the directors of the network.",{"$f":"'Scoring criteria'!E134","v":0},"Section 10 question 1, 3, 4 and 5"]
["10.D. Implementation of corrective measures",{"$f":"'Scoring criteria'!E137","v":1},"Section 10 question 19 and 20"]
["10.C. External evaluations carried out",{"$f":"'Scoring criteria'!E136","v":1},"Section 10 question 12, 15 and 16"]

{"sheet":"Output 2","index":3,"n_rows":32,"n_cols":1,"rows_kept":32,"cut":false,"hidden":false,"merged":[[30,0,30,10],[31,0,31,1],[0,0,0,10],[1,0,1,10],[2,0,2,10]]}
["SNATtrop"]
["Output 2"]
["Disease present"]
{"$rows_empty":28}
["Exotic disease"]

{"sheet":"Feedback_output_2","index":4,"n_rows":117,"n_cols":9,"rows_kept":117,"cut":false,"hidden":true,"merged":[[25,1,25,3],[14,1,14,3],[5,1,5,3],[0,1,0,3],[1,1,1,3],[3,1,3,4],[48,1,48,3],[54,1,54,3],[79,1,79,3],[98,1,98,3],[111,1,111,3]]}
[null,"Feedback for output 2"]
[null,"To get started click to classify the criteria. For each critical point, the criteria used are classified according to their weighs and their score.  In each table the first criteria need to be improve in priority "]
[]
[null,"Exotic disease"]
[]
[null,"Objectives"]
[null,"Criteria","Weigh","Score","Referencing question","Max","Priority (score+weigh)","Maximum","Missing points"]
[null,"1.A           Relevance of surveillance objectives",0.2,{"$f":"'Scoring criteria'!E15","v":3},"Section 1 question 1 and 3",3,{"$f":"((Tableau12[[#This Row],[Weigh]]*100)*Tableau12[[#This Row],[Score]])","v":60},{"$f":"((Tableau12[[#This Row],[Weigh]]*100)*F8)","v":60},{"$f":"IF(Tableau12[[#This Row],[Score]]<>\"NA\",Tableau12[[#This Row],[Maximum]]-Tableau12[[#This Row],[Priority (score+weigh)]],\"NA\")","v":0}]
[null,"1.D           Coherence of the diseases under surveillance with the sanitary situation (existing/exotic diseases or threats)",0.2,{"$f":"'Scoring criteria'!E18","v":3},"Section 1 question 3",3,{"$f":"((Tableau12[[#This Row],[Weigh]]*100)*Tableau12[[#This Row],[Score]])","v":60},{"$f":"((Tableau12[[#This Row],[Weigh]]*100)*F9)","v":60},{"$f":"IF(Tableau12[[#This Row],[Score]]<>\"NA\",Tableau12[[#This Row],[Maximum]]-Tableau12[[#This Row],[Priority (score+weigh)]],\"NA\")","v":0}]
[null,"1.C           Taking partners’ expectations into account",0.2,{"$f":"'Scoring criteria'!E17","v":3},"Section 1 question 4",3,{"$f":"((Tableau12[[#This Row],[Weigh]]*100)*Tableau12[[#This Row],[Score]])","v":60},{"$f":"((Tableau12[[#This Row],[Weigh]]*100)*F10)","v":60},{"$f":"IF(Tableau12[[#This Row],[Score]]<>\"NA\",Tableau12[[#This Row],[Maximum]]-Tableau12[[#This Row],[Priority (score+weigh)]],\"NA\")","v":0}]
[null,"6.A Appropriateness of surveillance procedures with the system's objectives",0.2,{"$f":"'Scoring criteria'!E86","v":0},"Section 5 (part 1) question 50, 48 and 49",3,{"$f":"((Tableau12[[#This Row],[Weigh]]*100)*Tableau12[[#This Row],[Score]])","v":0},{"$f":"((Tableau12[[#This Row],[Weigh]]*100)*F11)","v":60},{"$f":"IF(Tableau12[[#This Row],[Score]]<>\"NA\",Tableau12[[#This Row],[Maximum]]-Tableau12[[#This Row],[Priority (score+weigh)]],\"NA\")","v":60}]
[null,"1.B           Level of detail, accuracy, and formalization of objectives",0.2,{"$f":"'Scoring criteria'!E16","v":3},"Section 1 question 1 and 2",3,{"$f":"((Tableau12[[#This Row],[Weigh]]*100)*Tableau12[[#This Row],[Score]])","v":60},{"$f":"((Tableau12[[#This Row],[Weigh]]*100)*F12)","v":60},{"$f":"IF(Tableau12[[#This Row],[Score]]<>\"NA\",Tableau12[[#This Row],[Maximum]]-Tableau12[[#This Row],[Priority (score+weigh)]],\"NA\")","v":0}]
[]
[]
[null,"Sampling"]
[null,"Criteria","Weigh","Score","Referencing question","Max","Priority (score + weigh)","Maximum","Missing points"]
[null,"6.B Existence of passive (event-based) surveillance whose results are exhaustive or representative",0.35,{"$f":"'Scoring criteria'!E87","v":3},"Section 5 (part 1) question 16 and 38",3,{"$f":"((Tableau1214[[#This Row],[Weigh]]*100)*Tableau1214[[#This Row],[Score]])","v":105},{"$f":"((Tableau1214[[#This Row],[Weigh]]*100)*F17)","v":105},{"$f":"IF(D17<>\"NA\",H17-G17,\"NA\")","v":0}]
[null,"2.D Organization and operations of the system laid down in regulations, a charter, or a convention established between the partners",0.15,{"$f":"'Scoring criteria'!E27","v":0},"Section 2 question 57, 58 and 59",3,{"$f":"((Tableau1214[[#This Row],[Weigh]]*100)*Tableau1214[[#This Row],[Score]])","v":0},{"$f":"((Tableau1214[[#This Row],[Weigh]]*100)*F18)","v":45},45]
[null,"6.H Precision of sample under active (planned) surveillance",0.25,{"$f":"'Scoring criteria'!E93","v":"NA"},"Section 3 (part 1) question 31, section 3 (part 3) question 2  section 4 table at the end of the section column b and c",3,{"$f":"((Tableau1214[[#This Row],[Weigh]]*100)*Tableau1214[[#This Row],[Score]])","v":{"$error":"#VALUE!"}},{"$f":"((Tableau1214[[#This Row],[Weigh]]*100)*F19)","v":75},"NA"]
[null,"3.G Exhaustiveness or representativeness of the field agents’ coverage of the target population",0.1,{"$f":"'Scoring criteria'!E42","v":2},"Section 3 (part 2) question 10, 14 and 16",3,{"$f":"((Tableau1214[[#This Row],[Weigh]]*100)*Tableau1214[[#This Row],[Score]])","v":20},{"$f":"((Tableau1214[[#This Row],[Weigh]]*100)*F20)","v":30},10]
[null,"6.D Relevance and suitability of active (planned) surveillance protocols ",5.8000000000000003E-2,{"$f":"'Scoring criteria'!E89","v":1},"Section 5 (part 1) question 40, 42 and 41",3,{"$f":"((Tableau1214[[#This Row],[Weigh]]*100)*Tableau1214[[#This Row],[Score]])","v":5.8000000000000007},{"$f":"((Tableau1214[[#This Row],[Weigh]]*100)*F21)","v":17.400000000000002},11.600000000000001]
[null,"3.A Existence of formal intermediary units covering the entire territory",4.2000000000000003E-2,{"$f":"'Scoring criteria'!E36","v":3},"Section 3 question 1, 6 and 12",3,{"$f":"((Tableau1214[[#This Row],[Weigh]]*100)*Tableau1214[[#This Row],[Score]])","v":12.600000000000001},{"$f":"((Tableau1214[[#This Row],[Weigh]]*100)*F22)","v":12.600000000000001},0]
[null,"6.G Representativeness of the populations targeted by sampling in active (planned) surveillance",4.2000000000000003E-2,{"$f":"'Scoring criteria'!E92","v":"NA"},"Section 5 (part 1) question 33 and section 5 (part 3) question 29",3,{"$f":"((Tableau1214[[#This Row],[Weigh]]*100)*Tableau1214[[#This Row],[Score]])","v":{"$error":"#VALUE!"}},{"$f":"((Tableau1214[[#This Row],[Weigh]]*100)*F23)","v":12.600000000000001},"NA"]
[]
[]
[null,"Animation"]
[null,"Criteria","Weigh","Score","Referencing question ","Max","Priority (score + weigh)","Maximum","Missing points"]
[null,"6.C Existence of awareness building programs for data sources in a passive (event-based) network ",0.38300000000000001,{"$f":"'Scoring criteria'!E88","v":2},"Section 5 (part 1) question 61 and section 5 (part 3) question 23, 24 and 37",3,{"$f":"((Tableau121412[[#This Row],[Weigh]]*100)*Tableau121412[[#This Row],[Score]])","v":76.599999999999994},{"$f":"((Tableau121412[[#This Row],[Weigh]]*100)*F28)","v":114.89999999999999},{"$f":"IF(Tableau121412[[#This Row],[Score]]<>\"NA\",Tableau121412[[#This Row],[Maximum]]-Tableau121412[[#This Row],[Priority (score + weigh)]],\"NA\")","v":38.299999999999997}]
[null,"2.A Existence of an operational management structure (central unit)",6.6000000000000003E-2,{"$f":"'Scoring criteria'!E24","v":0.5},"Section 2 question 7, 9, 10, 20 and 22",3,{"$f":"((Tableau121412[[#This Row],[Weigh]]*100)*Tableau121412[[#This Row],[Score]])","v":3.3000000000000003},{"$f":"((Tableau121412[[#This Row],[Weigh]]*100)*F29)","v":19.8},{"$f":"IF(Tableau121412[[#This Row],[Score]]<>\"NA\",Tableau121412[[#This Row],[Maximum]]-Tableau121412[[#This Row],[Priority (score + weigh)]],\"NA\")","v":16.5}]
[null,"9.D. Systematic return of reports on results to field actors (outside of a bulletin). ",5.2999999999999999E-2,{"$f":"'Scoring criteria'!E125","v":3},"Section 9 question 25 and 26",3,{"$f":"((Tableau121412[[#This Row],[Weigh]]*100)*Tableau121412[[#This Row],[Score]])","v":15.899999999999999},{"$f":"((Tableau121412[[#This Row],[Weigh]]*100)*F30)","v":15.899999999999999},{"$f":"IF(Tableau121412[[#This Row],[Score]]<>\"NA\",Tableau121412[[#This Row],[Maximum]]-Tableau121412[[#This Row],[Priority (score + weigh)]],\"NA\")","v":0}]
[null,"4.A Effective integration of laboratories in the surveillance system",5.2999999999999999E-2,{"$f":"'Scoring criteria'!E49","v":3},"Section 4 question 1 and 2",3,{"$f":"((Tableau121412[[#This Row],[Weigh]]*100)*Tableau121412[[#This Row],[Score]])","v":15.899999999999999},{"$f":"((Tableau121412[[#This Row],[Weigh]]*100)*F31)","v":15.899999999999999},{"$f":"IF(Tableau121412[[#This Row],[Score]]<>\"NA\",Tableau121412[[#This Row],[Maximum]]-Tableau121412[[#This Row],[Priority (score + weigh)]],\"NA\")","v":0}]
[null,"8.D. Regular advanced training",5.2999999999999999E-2,{"$f":"'Scoring criteria'!E115","v":0},"Section 8 question 14 and 20",3,{"$f":"((Tableau121412[[#This Row],[Weigh]]*100)*Tableau121412[[#This Row],[Score]])","v":0},{"$f":"((Tableau121412[[#This Row],[Weigh]]*100)*F32)","v":15.899999999999999},{"$f":"IF(Tableau121412[[#This Row],[Score]]<>\"NA\",Tableau121412[[#This Row],[Maximum]]-Tableau121412[[#This Row],[Priority (score + weigh)]],\"NA\")","v":15.899999999999999}]
[null,"9.C. Regular dissemination of a relevant information bulletin",5.2999999999999999E-2,{"$f":"'Scoring criteria'!E124","v":1.5},"Section 9 question 33, 34, 35, 36 and 40",3,{"$f":"((Tableau121412[[#This Row],[Weigh]]*100)*Tableau121412[[#This Row],[Score]])","v":7.9499999999999993},{"$f":"((Tableau121412[[#This Row],[Weigh]]*100)*F33)","v":15.899999999999999},{"$f":"IF(Tableau121412[[#This Row],[Score]]<>\"NA\",Tableau121412[[#This Row],[Maximum]]-Tableau121412[[#This Row],[Priority (score + weigh)]],\"NA\")","v":7.9499999999999993}]
[null,"3.A Existence of formal intermediary units covering the entire territory",1.2E-2,{"$f":"'Scoring criteria'!E36","v":3},"Section 3 (part 1) question 1, 8 and 5",3,{"$f":"((Tableau121412[[#This Row],[Weigh]]*100)*Tableau121412[[#This Row],[Score]])","v":3.5999999999999996},{"$f":"((Tableau121412[[#This Row],[Weigh]]*100)*F34)","v":3.5999999999999996},{"$f":"IF(Tableau121412[[#This Row],[Score]]<>\"NA\",Tableau121412[[#This Row],[Maximum]]-Tableau121412[[#This Row],[Priority (score + weigh)]],\"NA\")","v":0}]
[null,"3.F Existence of coordination meetings at the intermediate level",1.2E-2,{"$f":"'Scoring criteria'!E41","v":2},"Section 3 (part 1) question 18, 21, 28, 30 and 32",3,{"$f":"((Tableau121412[[#This Row],[Weigh]]*100)*Tableau121412[[#This Row],[Score]])","v":2.4},{"$f":"((Tableau121412[[#This Row],[Weigh]]*100)*F35)","v":3.5999999999999996},{"$f":"IF(Tableau121412[[#This Row],[Score]]<>\"NA\",Tableau121412[[#This Row],[Maximum]]-Tableau121412[[#This Row],[Priority (score + weigh)]],\"NA\")","v":1.1999999999999997}]
[null,"2.B Existence of an operational steering structure that is representative of the partners (steering committee)",1.2E-2,{"$f":"'Scoring criteria'!E25","v":1},"Section 2 question 28/29, 31, 34, 37, 38 and 39",3,{"$f":"((Tableau121412[[#This Row],[Weigh]]*100)*Tableau121412[[#This Row],[Score]])","v":1.2},{"$f":"((Tableau121412[[#This Row],[Weigh]]*100)*F36)","v":3.5999999999999996},{"$f":"IF(Tableau121412[[#This Row],[Score]]<>\"NA\",Tableau121412[[#This Row],[Maximum]]-Tableau121412[[#This Row],[Priority (score + weigh)]],\"NA\")","v":2.3999999999999995}]
[null,"3.D Harmonization of intermediary units’ activities",1.2E-2,{"$f":"'Scoring criteria'!E39","v":0},"section 3 (part 1) question 12, 13 and 14",3,{"$f":"((Tableau121412[[#This Row],[Weigh]]*100)*Tableau121412[[#This Row],[Score]])","v":0},{"$f":"((Tableau121412[[#This Row],[Weigh]]*100)*F37)","v":3.5999999999999996},{"$f":"IF(Tableau121412[[#This Row],[Score]]<>\"NA\",Tableau121412[[#This Row],[Maximum]]-Tableau121412[[#This Row],[Priority (score + weigh)]],\"NA\")","v":3.5999999999999996}]
[null,"7.C. Designated staff available and trained in data entry, management and analysis.",1.2E-2,{"$f":"'Scoring criteria'!E102","v":1},"Section 7 question 52",3,{"$f":"((Tableau121412[[#This Row],[Weigh]]*100)*Tableau121412[[#This Row],[Score]])","v":1.2},{"$f":"((Tableau121412[[#This Row],[Weigh]]*100)*F38)","v":3.5999999999999996},{"$f":"IF(Tableau121412[[#This Row],[Score]]<>\"NA\",Tableau121412[[#This Row],[Maximum]]-Tableau121412[[#This Row],[Priority (score + weigh)]],\"NA\")","v":2.3999999999999995}]
[null,"2.E Frequency of meetings of the central coordinating body",1.2E-2,{"$f":"'Scoring criteria'!E28","v":2},"Section 2 question 61, 62, 65 and 67",3,{"$f":"((Tableau121412[[#This Row],[Weigh]]*100)*Tableau121412[[#This Row],[Score]])","v":2.4},{"$f":"((Tableau121412[[#This Row],[Weigh]]*100)*F39)","v":3.5999999999999996},{"$f":"IF(Tableau121412[[#This Row],[Score]]<>\"NA\",Tableau121412[[#This Row],[Maximum]]-Tableau121412[[#This Row],[Priority (score + weigh)]],\"NA\")","v":1.1999999999999997}]
[null,"8.A. Adequate skill level in epidemiology of members of the central unit",1.2E-2,{"$f":"'Scoring criteria'!E112","v":1},"Section 8 question 2 and 4",3,{"$f":"((Tableau121412[[#This Row],[Weigh]]*100)*Tableau121412[[#This Row],[Score]])","v":1.2},{"$f":"((Tableau121412[[#This Row],[Weigh]]*100)*F40)","v":3.5999999999999996},{"$f":"IF(Tableau121412[[#This Row],[Score]]<>\"NA\",Tableau121412[[#This Row],[Maximum]]-Tableau121412[[#This Row],[Priority (score + weigh)]],\"NA\")","v":2.3999999999999995}]
[null,"8.B. Initial training implemented for all field agents when joining the system",0.13,{"$f":"'Scoring criteria'!E113","v":1},"Section 8 question 9 and 10",3,{"$f":"((Tableau121412[[#This Row],[Weigh]]*100)*Tableau121412[[#This Row],[Score]])","v":13},{"$f":"((Tableau121412[[#This Row],[Weigh]]*100)*F41)","v":39},{"$f":"IF(Tableau121412[[#This Row],[Score]]<>\"NA\",Tableau121412[[#This Row],[Maximum]]-Tableau121412[[#This Row],[Priority (score + weigh)]],\"NA\")","v":26}]
[null,"2.C Existence of a scientific and technical committee for the system",6.6000000000000003E-2,{"$f":"'Scoring criteria'!E26","v":2},"Section 2 question 41, 45, 46, 48, 52 and 54",3,{"$f":"((Tableau121412[[#This Row],[Weigh]]*100)*Tableau121412[[#This Row],[Score]])","v":13.200000000000001},{"$f":"((Tableau121412[[#This Row],[Weigh]]*100)*F42)","v":19.8},{"$f":"IF(Tableau121412[[#This Row],[Score]]<>\"NA\",Tableau121412[[#This Row],[Maximum]]-Tableau121412[[#This Row],[Priority (score + weigh)]],\"NA\")","v":6.6}]
[null,"2.F Supervision of intermediary units by the central level",1.2E-2,{"$f":"'Scoring criteria'!E29","v":2},"Section 2 question 68, 70 and 73",3,{"$f":"((Tableau121412[[#This Row],[Weigh]]*100)*Tableau121412[[#This Row],[Score]])","v":2.4},{"$f":"((Tableau121412[[#This Row],[Weigh]]*100)*F43)","v":3.5999999999999996},{"$f":"IF(Tableau121412[[#This Row],[Score]]<>\"NA\",Tableau121412[[#This Row],[Maximum]]-Tableau121412[[#This Row],[Priority (score + weigh)]],\"NA\")","v":1.1999999999999997}]
[null,"4.F Existence of an investigation team to support field agents",1.2E-2,{"$f":"'Scoring criteria'!E54","v":2},"Section 4 question 52 and 53",3,{"$f":"((Tableau121412[[#This Row],[Weigh]]*100)*Tableau121412[[#This Row],[Score]])","v":2.4},{"$f":"((Tableau121412[[#This Row],[Weigh]]*100)*F44)","v":3.5999999999999996},{"$f":"IF(Tableau121412[[#This Row],[Score]]<>\"NA\",Tableau121412[[#This Row],[Maximum]]-Tableau121412[[#This Row],[Priority (score + weigh)]],\"NA\")","v":1.1999999999999997}]
[null,"3.B Active role of intermediary units in the functioning of the system (validation, management, feedback)",1.2E-2,{"$f":"'Scoring criteria'!E37","v":3},"Section 3 (part 2) question 1",3,{"$f":"((Tableau121412[[#This Row],[Weigh]]*100)*Tableau121412[[#This Row],[Score]])","v":3.5999999999999996},{"$f":"((Tableau121412[[#This Row],[Weigh]]*100)*F45)","v":3.5999999999999996},{"$f":"IF(Tableau121412[[#This Row],[Score]]<>\"NA\",Tableau121412[[#This Row],[Maximum]]-Tableau121412[[#This Row],[Priority (score + weigh)]],\"NA\")","v":0}]
[null,"3.C Implementation of supervision by the intermediary level\n",1.2E-2,{"$f":"'Scoring criteria'!E38","v":2.75},"Section 3 (part 2) question 5, 7 and 9",3,{"$f":"((Tableau121412[[#This Row],[Weigh]]*100)*Tableau121412[[#This Row],[Score]])","v":3.3},{"$f":"((Tableau121412[[#This Row],[Weigh]]*100)*F46)","v":3.5999999999999996},{"$f":"IF(Tableau121412[[#This Row],[Score]]<>\"NA\",Tableau121412[[#This Row],[Maximum]]-Tableau121412[[#This Row],[Priority (score + weigh)]],\"NA\")","v":0.29999999999999982}]
[]
[]
[null,"Environment"]
[null,"Criteria","Weigh","Score","Referencing question","Max","Priority (score + weigh)","Maximum","Missing points"]
[null,"6.E Surveillance of susceptible wild animals",0.5,{"$f":"'Scoring criteria'!E90","v":0},"Section 5 (part 1) qestion 44 and section (part 3) question 35 and 36",3,{"$f":"((Tableau14[[#This Row],[Weigh]]*100)*Tableau14[[#This Row],[Score]])","v":0},{"$f":"((Tableau14[[#This Row],[Weigh]])*100)*F51","v":150},{"$f":"IF(Tableau14[[#This Row],[Score]]<>\"NA\",Tableau14[[#This Row],[Maximum]]-Tableau14[[#This Row],[Priority (score + weigh)]],\"NA\")","v":150}]
[null,"6.F Vector surveillance and control",0.5,{"$f":"'Scoring criteria'!E91","v":"NA"},"Section 5 (part 1) question 46 and section 5 (part 3) question 37 and 38",3,{"$f":"((Tableau14[[#This Row],[Weigh]]*100)*Tableau14[[#This Row],[Score]])","v":{"$error":"#VALUE!"}},{"$f":"((Tableau14[[#This Row],[Weigh]])*100)*F52","v":150},{"$f":"IF(Tableau14[[#This Row],[Score]]<>\"NA\",Tableau14[[#This Row],[Maximum]]-Tableau14[[#This Row],[Priority (score + weigh)]],\"NA\")","v":"NA"}]
[]
[]
[null,"Tools"]
[null,"Criteria","Weigh","Score","Referencing question","Max","Priority (score + weigh)","Maximum","Missing points"]
[null,"8.D. Regular advanced training",5.2999999999999999E-2,{"$f":"'Scoring criteria'!E115","v":0},"Section 8 question 14 and 20",3,{"$f":"((Tableau12141216[[#This Row],[Weigh]]*100)*Tableau12141216[[#This Row],[Score]])","v":0},{"$f":"((Tableau12141216[[#This Row],[Weigh]]*100)*F57)","v":15.899999999999999},{"$f":"IF(Tableau12141216[[#This Row],[Score]]<>\"NA\",Tableau12141216[[#This Row],[Maximum]]-Tableau12141216[[#This Row],[Priority (score + weigh)]],\"NA\")","v":15.899999999999999}]
[null,"4.D Quality of the standardization of work between different laboratories",0.05,{"$f":"'Scoring criteria'!E52","v":3},"Section 4 question 3, 21, 48 and 49",3,{"$f":"((Tableau12141216[[#This Row],[Weigh]]*100)*Tableau12141216[[#This Row],[Score]])","v":15},{"$f":"((Tableau12141216[[#This Row],[Weigh]]*100)*F58)","v":15},{"$f":"IF(Tableau12141216[[#This Row],[Score]]<>\"NA\",Tableau12141216[[#This Row],[Maximum]]-Tableau12141216[[#This Row],[Priority (score + weigh)]],\"NA\")","v":0}]
[null,"4.A Effective integration of laboratories in the surveillance system",0.05,{"$f":"'Scoring criteria'!E49","v":3},"Section 4 question 1 and 2",3,{"$f":"((Tableau12141216[[#This Row],[Weigh]]*100)*Tableau12141216[[#This Row],[Score]])","v":15},{"$f":"((Tableau12141216[[#This Row],[Weigh]]*100)*F59)","v":15},{"$f":"IF(Tableau12141216[[#This Row],[Score]]<>\"NA\",Tableau12141216[[#This Row],[Maximum]]-Tableau12141216[[#This Row],[Priority (score + weigh)]],\"NA\")","v":0}]
[null,"5.J Quality of samples collected",2.8000000000000001E-2,{"$f":"'Scoring criteria'!E76","v":3},"Section 5 (part 1) question 28",3,{"$f":"((Tableau12141216[[#This Row],[Weigh]]*100)*Tableau12141216[[#This Row],[Score]])","v":8.4},{"$f":"((Tableau12141216[[#This Row],[Weigh]]*100)*F60)","v":8.4},{"$f":"IF(Tableau12141216[[#This Row],[Score]]<>\"NA\",Tableau12141216[[#This Row],[Maximum]]-Tableau12141216[[#This Row],[Priority (score + weigh)]],\"NA\")","v":0}]
[null,"5.A Existence of a formalized surveillance protocol for each disease or threat under surveillance",2.8000000000000001E-2,{"$f":"'Scoring criteria'!E67","v":2},"Section 5 (part 1) question 1 and 2 to 13",3,{"$f":"((Tableau12141216[[#This Row],[Weigh]]*100)*Tableau12141216[[#This Row],[Score]])","v":5.6000000000000005},{"$f":"((Tableau12141216[[#This Row],[Weigh]]*100)*F61)","v":8.4},{"$f":"IF(Tableau12141216[[#This Row],[Score]]<>\"NA\",Tableau12141216[[#This Row],[Maximum]]-Tableau12141216[[#This Row],[Priority (score + weigh)]],\"NA\")","v":2.8}]
[null,"5.H Relevance of collected  samples",2.8000000000000001E-2,{"$f":"'Scoring criteria'!E74","v":2.5},"Section 5 (part 1) question 24, Section 5 (part 2) question 9 Section 5 (part 3) Quesstion 14 section 1 question 1 and 3",3,{"$f":"((Tableau12141216[[#This Row],[Weigh]]*100)*Tableau12141216[[#This Row],[Score]])","v":7.0000000000000009},{"$f":"((Tableau12141216[[#This Row],[Weigh]]*100)*F62)","v":8.4},{"$f":"IF(Tableau12141216[[#This Row],[Score]]<>\"NA\",Tableau12141216[[#This Row],[Maximum]]-Tableau12141216[[#This Row],[Priority (score + weigh)]],\"NA\")","v":1.3999999999999995}]
[null,"5.I Standardization of collected samples",2.8000000000000001E-2,{"$f":"'Scoring criteria'!E75","v":3},"Section 5 (part 1) question 25 and 26",3,{"$f":"((Tableau12141216[[#This Row],[Weigh]]*100)*Tableau12141216[[#This Row],[Score]])","v":8.4},{"$f":"((Tableau12141216[[#This Row],[Weigh]]*100)*F63)","v":8.4},{"$f":"IF(Tableau12141216[[#This Row],[Score]]<>\"NA\",Tableau12141216[[#This Row],[Maximum]]-Tableau12141216[[#This Row],[Priority (score + weigh)]],\"NA\")","v":0}]
[null,"8.C. Objectives and contents of initial training of system field actors adequate for operational surveillance needs",5.2999999999999999E-2,{"$f":"'Scoring criteria'!E114","v":2.5},"Section 8 question 11",3,{"$f":"((Tableau12141216[[#This Row],[Weigh]]*100)*Tableau12141216[[#This Row],[Score]])","v":13.25},{"$f":"((Tableau12141216[[#This Row],[Weigh]]*100)*F64)","v":15.899999999999999},{"$f":"IF(Tableau12141216[[#This Row],[Score]]<>\"NA\",Tableau12141216[[#This Row],[Maximum]]-Tableau12141216[[#This Row],[Priority (score + weigh)]],\"NA\")","v":2.6499999999999986}]
[null,"4.E Proportion of tests submitted to inter-laboratory trials",0.05,{"$f":"'Scoring criteria'!E53","v":3},"Section 4 table at the end of the section column m",3,{"$f":"((Tableau12141216[[#This Row],[Weigh]]*100)*Tableau12141216[[#This Row],[Score]])","v":15},{"$f":"((Tableau12141216[[#This Row],[Weigh]]*100)*F65)","v":15},{"$f":"IF(Tableau12141216[[#This Row],[Score]]<>\"NA\",Tableau12141216[[#This Row],[Maximum]]-Tableau12141216[[#This Row],[Priority (score + weigh)]],\"NA\")","v":0}]
[null,"5.D Sensitivity of the case or threat definition",2.5000000000000001E-2,{"$f":"'Scoring criteria'!E70","v":3},"Section 5 question 16",3,{"$f":"((Tableau12141216[[#This Row],[Weigh]]*100)*Tableau12141216[[#This Row],[Score]])","v":7.5},{"$f":"((Tableau12141216[[#This Row],[Weigh]]*100)*F66)","v":7.5},{"$f":"IF(Tableau12141216[[#This Row],[Score]]<>\"NA\",Tableau12141216[[#This Row],[Maximum]]-Tableau12141216[[#This Row],[Priority (score + weigh)]],\"NA\")","v":0}]
[null,"5.E Specificity of the case or threat definition",2.5000000000000001E-2,{"$f":"'Scoring criteria'!E71","v":1.5},"Section 5 question 17",3,{"$f":"((Tableau12141216[[#This Row],[Weigh]]*100)*Tableau12141216[[#This Row],[Score]])","v":3.75},{"$f":"((Tableau12141216[[#This Row],[Weigh]]*100)*F67)","v":7.5},{"$f":"IF(Tableau12141216[[#This Row],[Score]]<>\"NA\",Tableau12141216[[#This Row],[Maximum]]-Tableau12141216[[#This Row],[Priority (score + weigh)]],\"NA\")","v":3.75}]
[null,"5.B Standardization of data collected",2.5000000000000001E-2,{"$f":"'Scoring criteria'!E68","v":3},"Section 5 (part 1) question 14, 19, 20, 22 and 23",3,{"$f":"((Tableau12141216[[#This Row],[Weigh]]*100)*Tableau12141216[[#This Row],[Score]])","v":7.5},{"$f":"((Tableau12141216[[#This Row],[Weigh]]*100)*F68)","v":7.5},{"$f":"IF(Tableau12141216[[#This Row],[Score]]<>\"NA\",Tableau12141216[[#This Row],[Maximum]]-Tableau12141216[[#This Row],[Priority (score + weigh)]],\"NA\")","v":0}]
[null,"5.C Relevance of measurement tools (excluding laboratory tools)",2.5000000000000001E-2,{"$f":"'Scoring criteria'!E69","v":3},"Section 5 (part 2) question 6, Section 5 (part 3) question 9 and section 1 question 1 ",3,{"$f":"((Tableau12141216[[#This Row],[Weigh]]*100)*Tableau12141216[[#This Row],[Score]])","v":7.5},{"$f":"((Tableau12141216[[#This Row],[Weigh]]*100)*F69)","v":7.5},{"$f":"IF(Tableau12141216[[#This Row],[Score]]<>\"NA\",Tableau12141216[[#This Row],[Maximum]]-Tableau12141216[[#This Row],[Priority (score + weigh)]],\"NA\")","v":0}]
[null,"5.F Simplicity of the case or threat definition",2.5000000000000001E-2,{"$f":"'Scoring criteria'!E72","v":2},"Section 5 (part 2 and 3)  question 1",3,{"$f":"((Tableau12141216[[#This Row],[Weigh]]*100)*Tableau12141216[[#This Row],[Score]])","v":5},{"$f":"((Tableau12141216[[#This Row],[Weigh]]*100)*F70)","v":7.5},{"$f":"IF(Tableau12141216[[#This Row],[Score]]<>\"NA\",Tableau12141216[[#This Row],[Maximum]]-Tableau12141216[[#This Row],[Priority (score + weigh)]],\"NA\")","v":2.5}]
[null,"4.J Control of laboratory reagents",0.2,{"$f":"'Scoring criteria'!E58","v":3},"Section 4 question 23 and 51",3,{"$f":"((Tableau12141216[[#This Row],[Weigh]]*100)*Tableau12141216[[#This Row],[Score]])","v":60},{"$f":"((Tableau12141216[[#This Row],[Weigh]]*100)*F71)","v":60},{"$f":"IF(Tableau12141216[[#This Row],[Score]]<>\"NA\",Tableau12141216[[#This Row],[Maximum]]-Tableau12141216[[#This Row],[Priority (score + weigh)]],\"NA\")","v":0}]
[null,"4.G Relevance of diagnostic techniques",0.05,{"$f":"'Scoring criteria'!E55","v":3},"Section 4 question 54, 55 and 56",3,{"$f":"((Tableau12141216[[#This Row],[Weigh]]*100)*Tableau12141216[[#This Row],[Score]])","v":15},{"$f":"((Tableau12141216[[#This Row],[Weigh]]*100)*F72)","v":15},{"$f":"IF(Tableau12141216[[#This Row],[Score]]<>\"NA\",Tableau12141216[[#This Row],[Maximum]]-Tableau12141216[[#This Row],[Priority (score + weigh)]],\"NA\")","v":0}]
[null,"4.C Application of Quality Assurance for the tests undertaken",0.05,{"$f":"'Scoring criteria'!E51","v":3},"Section 4 table at the end of the section column l",3,{"$f":"((Tableau12141216[[#This Row],[Weigh]]*100)*Tableau12141216[[#This Row],[Score]])","v":15},{"$f":"((Tableau12141216[[#This Row],[Weigh]]*100)*F73)","v":15},{"$f":"IF(Tableau12141216[[#This Row],[Score]]<>\"NA\",Tableau12141216[[#This Row],[Maximum]]-Tableau12141216[[#This Row],[Priority (score + weigh)]],\"NA\")","v":0}]
[null,"4.H Sensitivity of diagnostic techniques",0.05,{"$f":"'Scoring criteria'!E56","v":1.5},"Section 4 table at the end of the section column b",3,{"$f":"((Tableau12141216[[#This Row],[Weigh]]*100)*Tableau12141216[[#This Row],[Score]])","v":7.5},{"$f":"((Tableau12141216[[#This Row],[Weigh]]*100)*F74)","v":15},{"$f":"IF(Tableau12141216[[#This Row],[Score]]<>\"NA\",Tableau12141216[[#This Row],[Maximum]]-Tableau12141216[[#This Row],[Priority (score + weigh)]],\"NA\")","v":7.5}]
[null,"8.B. Initial training implemented for all field agents when joining the system",5.2999999999999999E-2,{"$f":"'Scoring criteria'!E113","v":1},"Section 8 question 9 and 10",3,{"$f":"((Tableau12141216[[#This Row],[Weigh]]*100)*Tableau12141216[[#This Row],[Score]])","v":5.3},{"$f":"((Tableau12141216[[#This Row],[Weigh]]*100)*F75)","v":15.899999999999999},{"$f":"IF(Tableau12141216[[#This Row],[Score]]<>\"NA\",Tableau12141216[[#This Row],[Maximum]]-Tableau12141216[[#This Row],[Priority (score + weigh)]],\"NA\")","v":10.599999999999998}]
[null,"4.L Analysis deadlines at the laboratory (formalization, standardization, verification, transfer of results to the central unit)",0.05,{"$f":"'Scoring criteria'!E60","v":0},"Section 4 table at the end of the section column j and k and question 20 and 47",3,{"$f":"((Tableau12141216[[#This Row],[Weigh]]*100)*Tableau12141216[[#This Row],[Score]])","v":0},{"$f":"((Tableau12141216[[#This Row],[Weigh]]*100)*F76)","v":15},{"$f":"IF(Tableau12141216[[#This Row],[Score]]<>\"NA\",Tableau12141216[[#This Row],[Maximum]]-Tableau12141216[[#This Row],[Priority (score + weigh)]],\"NA\")","v":15}]
[null,"4.M Quality of results delivered",0.05,{"$f":"'Scoring criteria'!E61","v":3},"Section 4 question 58 and 59",3,{"$f":"((Tableau12141216[[#This Row],[Weigh]]*100)*Tableau12141216[[#This Row],[Score]])","v":15},{"$f":"((Tableau12141216[[#This Row],[Weigh]]*100)*F77)","v":15},{"$f":"IF(Tableau12141216[[#This Row],[Score]]<>\"NA\",Tableau12141216[[#This Row],[Maximum]]-Tableau12141216[[#This Row],[Priority (score + weigh)]],\"NA\")","v":0}]
[]
[]
[null,"Collection and circulation of data"]
[null,"Criteria","Weigh","Score","Referencing question","Max","Priority (score + weigh)","Maximum","Missing points"]
[null,"5.L Simplicity of the notification procedure",7.0999999999999994E-2,{"$f":"'Scoring criteria'!E78","v":2},"Section 5 (part 1) question 36, section 5 (part 2) question 16, 4 and 15 and Section 5 (part 3) question 7, 19 and 20",3,{"$f":"((Tableau12141217[[#This Row],[Weigh]]*100)*Tableau12141217[[#This Row],[Score]])","v":14.2},{"$f":"((Tableau12141217[[#This Row],[Weigh]]*100)*F82)","v":21.299999999999997},{"$f":"IF(Tableau12141217[[#This Row],[Score]]<>\"NA\",Tableau12141217[[#This Row],[Maximum]]-Tableau12141217[[#This Row],[Priority (score + weigh)]],\"NA\")","v":7.0999999999999979}]
[null,"5.K Respect of the interval between the detection of a case or threat and the delivery of results",7.0999999999999994E-2,{"$f":"'Scoring criteria'!E77","v":3},"Section 5 (part 1) question31, 32, 33 and 34",3,{"$f":"((Tableau12141217[[#This Row],[Weigh]]*100)*Tableau12141217[[#This Row],[Score]])","v":21.299999999999997},{"$f":"((Tableau12141217[[#This Row],[Weigh]]*100)*F83)","v":21.299999999999997},{"$f":"IF(Tableau12141217[[#This Row],[Score]]<>\"NA\",Tableau12141217[[#This Row],[Maximum]]-Tableau12141217[[#This Row],[Priority (score + weigh)]],\"NA\")","v":0}]
[null,"5.J Quality of samples collected",6.2E-2,{"$f":"'Scoring criteria'!E76","v":3},"Section 5 (part 1) question 28",3,{"$f":"((Tableau12141217[[#This Row],[Weigh]]*100)*Tableau12141217[[#This Row],[Score]])","v":18.600000000000001},{"$f":"((Tableau12141217[[#This Row],[Weigh]]*100)*F84)","v":18.600000000000001},{"$f":"IF(Tableau12141217[[#This Row],[Score]]<>\"NA\",Tableau12141217[[#This Row],[Maximum]]-Tableau12141217[[#This Row],[Priority (score + weigh)]],\"NA\")","v":0}]
[null,"9.E. Presence of a communications system organized transversally and vertically between field actors (mail, web, telephone…)",7.0999999999999994E-2,{"$f":"'Scoring criteria'!E126","v":3},"Section 9 question 13 and 16 ",3,{"$f":"((Tableau12141217[[#This Row],[Weigh]]*100)*Tableau12141217[[#This Row],[Score]])","v":21.299999999999997},{"$f":"((Tableau12141217[[#This Row],[Weigh]]*100)*F85)","v":21.299999999999997},{"$f":"IF(Tableau12141217[[#This Row],[Score]]<>\"NA\",Tableau12141217[[#This Row],[Maximum]]-Tableau12141217[[#This Row],[Priority (score + weigh)]],\"NA\")","v":0}]
[null,"3.F Existence of coordination meetings at the intermediate level",6.2E-2,{"$f":"'Scoring criteria'!E41","v":2},"Section 3 (part 1) question 18, 21, 28, 30 and 32",3,{"$f":"((Tableau12141217[[#This Row],[Weigh]]*100)*Tableau12141217[[#This Row],[Score]])","v":12.4},{"$f":"((Tableau12141217[[#This Row],[Weigh]]*100)*F86)","v":18.600000000000001},{"$f":"IF(Tableau12141217[[#This Row],[Score]]<>\"NA\",Tableau12141217[[#This Row],[Maximum]]-Tableau12141217[[#This Row],[Priority (score + weigh)]],\"NA\")","v":6.2000000000000011}]
[null,"2.A Existence of an operational management structure (central unit)",6.2E-2,{"$f":"'Scoring criteria'!E24","v":0.5},"Section 2 question 7, 9, 10, 20 and 22",3,{"$f":"((Tableau12141217[[#This Row],[Weigh]]*100)*Tableau12141217[[#This Row],[Score]])","v":3.1},{"$f":"((Tableau12141217[[#This Row],[Weigh]]*100)*F87)","v":18.600000000000001},{"$f":"IF(Tableau12141217[[#This Row],[Score]]<>\"NA\",Tableau12141217[[#This Row],[Maximum]]-Tableau12141217[[#This Row],[Priority (score + weigh)]],\"NA\")","v":15.500000000000002}]
[null,"8.D. Regular advanced training",6.2E-2,{"$f":"'Scoring criteria'!E115","v":0},"Section 8 question 14 and 20",3,{"$f":"((Tableau12141217[[#This Row],[Weigh]]*100)*Tableau12141217[[#This Row],[Score]])","v":0},{"$f":"((Tableau12141217[[#This Row],[Weigh]]*100)*F88)","v":18.600000000000001},{"$f":"IF(Tableau12141217[[#This Row],[Score]]<>\"NA\",Tableau12141217[[#This Row],[Maximum]]-Tableau12141217[[#This Row],[Priority (score + weigh)]],\"NA\")","v":18.600000000000001}]
[null,"5.G Quality of the filling out of investigation forms",6.2E-2,{"$f":"'Scoring criteria'!E73","v":3},"Section 5 (part 1) question 19 and 21",3,{"$f":"((Tableau12141217[[#This Row],[Weigh]]*100)*Tableau12141217[[#This Row],[Score]])","v":18.600000000000001},{"$f":"((Tableau12141217[[#This Row],[Weigh]]*100)*F89)","v":18.600000000000001},{"$f":"IF(Tableau12141217[[#This Row],[Score]]<>\"NA\",Tableau12141217[[#This Row],[Maximum]]-Tableau12141217[[#This Row],[Priority (score + weigh)]],\"NA\")","v":0}]
[null,"4.B Adequacy of human, material, and financial resources for diagnostic needs",7.0999999999999994E-2,{"$f":"'Scoring criteria'!E50","v":0},"Section 4 question 8, 9, 10, 35, 36 and 37",3,{"$f":"((Tableau12141217[[#This Row],[Weigh]]*100)*Tableau12141217[[#This Row],[Score]])","v":0},{"$f":"((Tableau12141217[[#This Row],[Weigh]]*100)*F90)","v":21.299999999999997},{"$f":"IF(Tableau12141217[[#This Row],[Score]]<>\"NA\",Tableau12141217[[#This Row],[Maximum]]-Tableau12141217[[#This Row],[Priority (score + weigh)]],\"NA\")","v":21.299999999999997}]
[null,"9.B. Return of individual test results to field actors",7.0999999999999994E-2,{"$f":"'Scoring criteria'!E123","v":3},"Section 9 question 14",3,{"$f":"((Tableau12141217[[#This Row],[Weigh]]*100)*Tableau12141217[[#This Row],[Score]])","v":21.299999999999997},{"$f":"((Tableau12141217[[#This Row],[Weigh]]*100)*F91)","v":21.299999999999997},{"$f":"IF(Tableau12141217[[#This Row],[Score]]<>\"NA\",Tableau12141217[[#This Row],[Maximum]]-Tableau12141217[[#This Row],[Priority (score + weigh)]],\"NA\")","v":0}]
[null,"3.D Harmonization of intermediary units’ activities",6.2E-2,{"$f":"'Scoring criteria'!E39","v":0},"section 3 (part 1) question 12, 13 and 14",3,{"$f":"((Tableau12141217[[#This Row],[Weigh]]*100)*Tableau12141217[[#This Row],[Score]])","v":0},{"$f":"((Tableau12141217[[#This Row],[Weigh]]*100)*F92)","v":18.600000000000001},{"$f":"IF(Tableau12141217[[#This Row],[Score]]<>\"NA\",Tableau12141217[[#This Row],[Maximum]]-Tableau12141217[[#This Row],[Priority (score + weigh)]],\"NA\")","v":18.600000000000001}]
[null,"8.C. Objectives and contents of initial training of system field actors adequate for operational surveillance needs",6.2E-2,{"$f":"'Scoring criteria'!E114","v":2.5},"Section 8 question 11",3,{"$f":"((Tableau12141217[[#This Row],[Weigh]]*100)*Tableau12141217[[#This Row],[Score]])","v":15.5},{"$f":"((Tableau12141217[[#This Row],[Weigh]]*100)*F93)","v":18.600000000000001},{"$f":"IF(Tableau12141217[[#This Row],[Score]]<>\"NA\",Tableau12141217[[#This Row],[Maximum]]-Tableau12141217[[#This Row],[Priority (score + weigh)]],\"NA\")","v":3.1000000000000014}]
[null,"7.B Data input interval in accordance with the objectives and use of system results",7.0999999999999994E-2,{"$f":"'Scoring criteria'!E101","v":0},"Section 7 question 18",3,{"$f":"((Tableau12141217[[#This Row],[Weigh]]*100)*Tableau12141217[[#This Row],[Score]])","v":0},{"$f":"((Tableau12141217[[#This Row],[Weigh]]*100)*F94)","v":21.299999999999997},{"$f":"IF(Tableau12141217[[#This Row],[Score]]<>\"NA\",Tableau12141217[[#This Row],[Maximum]]-Tableau12141217[[#This Row],[Priority (score + weigh)]],\"NA\")","v":21.299999999999997}]
[null,"8.B. Initial training implemented for all field agents when joining the system",6.2E-2,{"$f":"'Scoring criteria'!E113","v":1},"Section 8 question 9 and 10",3,{"$f":"((Tableau12141217[[#This Row],[Weigh]]*100)*Tableau12141217[[#This Row],[Score]])","v":6.2},{"$f":"((Tableau12141217[[#This Row],[Weigh]]*100)*F95)","v":18.600000000000001},{"$f":"IF(Tableau12141217[[#This Row],[Score]]<>\"NA\",Tableau12141217[[#This Row],[Maximum]]-Tableau12141217[[#This Row],[Priority (score + weigh)]],\"NA\")","v":12.400000000000002}]
[null,"4.L Analysis deadlines at the laboratory (formalization, standardization, verification, transfer of results to the central unit)",7.0999999999999994E-2,{"$f":"'Scoring criteria'!E60","v":0},"Section 4 table at the end of the section column j and k and question 20 and 47",3,{"$f":"((Tableau12141217[[#This Row],[Weigh]]*100)*Tableau12141217[[#This Row],[Score]])","v":0},{"$f":"((Tableau12141217[[#This Row],[Weigh]]*100)*F96)","v":21.299999999999997},{"$f":"IF(Tableau12141217[[#This Row],[Score]]<>\"NA\",Tableau12141217[[#This Row],[Maximum]]-Tableau12141217[[#This Row],[Priority (score + weigh)]],\"NA\")","v":21.299999999999997}]
[]
[]
[null,"Processing and interpretation"]
[null,"Criteria","Weigh","Score","Referencing question","Max","Priority (score + weigh)","Maximum","Missing points"]
[null,"7.G. Exploitation of data fits the needs of the system (if possible regular and multi-disciplinary)",0.16,{"$f":"'Scoring criteria'!E106","v":0},"Section 7 question 31, 33 and 34",3,{"$f":"((Tableau17[[#This Row],[Weigh]]*100)*Tableau17[[#This Row],[Score]])","v":0},{"$f":"((Tableau17[[#This Row],[Weigh]]*100)*F101)","v":48},{"$f":"IF(Tableau17[[#This Row],[Score]]<>\"NA\",Tableau17[[#This Row],[Maximum]]-Tableau17[[#This Row],[Priority (score + weigh)]],\"NA\")","v":48}]
[null,"8.A. Adequate skill level in epidemiology of members of the central unit",0.23100000000000001,{"$f":"'Scoring criteria'!E112","v":1},"Section 8 question 2 and 4",3,{"$f":"((Tableau17[[#This Row],[Weigh]]*100)*Tableau17[[#This Row],[Score]])","v":23.1},{"$f":"((Tableau17[[#This Row],[Weigh]]*100)*F102)","v":69.300000000000011},{"$f":"IF(Tableau17[[#This Row],[Score]]<>\"NA\",Tableau17[[#This Row],[Maximum]]-Tableau17[[#This Row],[Priority (score + weigh)]],\"NA\")","v":46.20000000000001}]
[null,"4.B Adequacy of human, material, and financial resources for diagnostic needs",7.0999999999999994E-2,{"$f":"'Scoring criteria'!E50","v":0},"Section 4 question 8, 9, 10, 35, 36 and 37",3,{"$f":"((Tableau17[[#This Row],[Weigh]]*100)*Tableau17[[#This Row],[Score]])","v":0},{"$f":"((Tableau17[[#This Row],[Weigh]]*100)*F103)","v":21.299999999999997},{"$f":"IF(Tableau17[[#This Row],[Score]]<>\"NA\",Tableau17[[#This Row],[Maximum]]-Tableau17[[#This Row],[Priority (score + weigh)]],\"NA\")","v":21.299999999999997}]
[null,"7.C. Designated staff available and trained in data entry, management and analysis.",7.0999999999999994E-2,{"$f":"'Scoring criteria'!E102","v":1},"Section 7 question 52",3,{"$f":"((Tableau17[[#This Row],[Weigh]]*100)*Tableau17[[#This Row],[Score]])","v":7.1},{"$f":"((Tableau17[[#This Row],[Weigh]]*100)*F104)","v":21.299999999999997},{"$f":"IF(Tableau17[[#This Row],[Score]]<>\"NA\",Tableau17[[#This Row],[Maximum]]-Tableau17[[#This Row],[Priority (score + weigh)]],\"NA\")","v":14.199999999999998}]
[null,"7.A. Adequacy of the data management system for the needs of the system (relational database, etc.)",7.0999999999999994E-2,{"$f":"'Scoring criteria'!E100","v":3},"Section 7 question 3, 8 and 9 ",3,{"$f":"((Tableau17[[#This Row],[Weigh]]*100)*Tableau17[[#This Row],[Score]])","v":21.299999999999997},{"$f":"((Tableau17[[#This Row],[Weigh]]*100)*F105)","v":21.299999999999997},{"$f":"IF(Tableau17[[#This Row],[Score]]<>\"NA\",Tableau17[[#This Row],[Maximum]]-Tableau17[[#This Row],[Priority (score + weigh)]],\"NA\")","v":0}]
[null,"7.F Complete descriptive processing of data",7.0999999999999994E-2,{"$f":"'Scoring criteria'!E105","v":3},"Section 7 question 36, 37, 38, 40 and 49",3,{"$f":"((Tableau17[[#This Row],[Weigh]]*100)*Tableau17[[#This Row],[Score]])","v":21.299999999999997},{"$f":"((Tableau17[[#This Row],[Weigh]]*100)*F106)","v":21.299999999999997},{"$f":"IF(Tableau17[[#This Row],[Score]]<>\"NA\",Tableau17[[#This Row],[Maximum]]-Tableau17[[#This Row],[Priority (score + weigh)]],\"NA\")","v":0}]
[null,"2.C Existence of a scientific and technical committee for the system",0.16,{"$f":"'Scoring criteria'!E26","v":2},"Section 2 question 41, 45, 46, 48, 52 and 54",3,{"$f":"((Tableau17[[#This Row],[Weigh]]*100)*Tableau17[[#This Row],[Score]])","v":32},{"$f":"((Tableau17[[#This Row],[Weigh]]*100)*F107)","v":48},{"$f":"IF(Tableau17[[#This Row],[Score]]<>\"NA\",Tableau17[[#This Row],[Maximum]]-Tableau17[[#This Row],[Priority (score + weigh)]],\"NA\")","v":16}]
[null,"4.K Technical level of data management at the laboratory",7.0999999999999994E-2,{"$f":"'Scoring criteria'!E59","v":1.5},"Section 4 question 15, 18 and 45",3,{"$f":"((Tableau17[[#This Row],[Weigh]]*100)*Tableau17[[#This Row],[Score]])","v":10.649999999999999},{"$f":"((Tableau17[[#This Row],[Weigh]]*100)*F108)","v":21.299999999999997},{"$f":"IF(Tableau17[[#This Row],[Score]]<>\"NA\",Tableau17[[#This Row],[Maximum]]-Tableau17[[#This Row],[Priority (score + weigh)]],\"NA\")","v":10.649999999999999}]
[null,"4.L Analysis deadlines at the laboratory (formalization, standardization, verification, transfer of results to the central unit)",7.0999999999999994E-2,{"$f":"'Scoring criteria'!E60","v":0},"Section 4 table at the end of the section column j and k and question 20 and 47",3,{"$f":"((Tableau17[[#This Row],[Weigh]]*100)*Tableau17[[#This Row],[Score]])","v":0},{"$f":"((Tableau17[[#This Row],[Weigh]]*100)*F109)","v":21.299999999999997},{"$f":"IF(Tableau17[[#This Row],[Score]]<>\"NA\",Tableau17[[#This Row],[Maximum]]-Tableau17[[#This Row],[Priority (score + weigh)]],\"NA\")","v":21.299999999999997}]
[]
[]
[null,"Diffusion and information"]
[null,"Criteria","Weigh","Score","Referencing question","Max","Priority (score + weigh)","Maximum","Missing points"]
[null,"9.C. Regular dissemination of a relevant information bulletin",0.375,{"$f":"'Scoring criteria'!E124","v":1.5},"Section 9 question 33, 34, 35, 36 and 40",3,{"$f":"((Tableau18[[#This Row],[Weigh]]*100)*Tableau18[[#This Row],[Score]])","v":56.25},{"$f":"((Tableau18[[#This Row],[Weigh]]*100)*F114)","v":112.5},{"$f":"IF(Tableau18[[#This Row],[Score]]<>\"NA\",Tableau18[[#This Row],[Maximum]]-Tableau18[[#This Row],[Priority (score + weigh)]],\"NA\")","v":56.25}]
[null,"9.A Regular release of reports and scientific articles on surveillance results",0.375,{"$f":"'Scoring criteria'!E122","v":0},"Section 9 question 9, 10 and 11",3,{"$f":"((Tableau18[[#This Row],[Weigh]]*100)*Tableau18[[#This Row],[Score]])","v":0},{"$f":"((Tableau18[[#This Row],[Weigh]]*100)*F115)","v":112.5},{"$f":"IF(Tableau18[[#This Row],[Score]]<>\"NA\",Tableau18[[#This Row],[Maximum]]-Tableau18[[#This Row],[Priority (score + weigh)]],\"NA\")","v":112.5}]
[null,"9.D. Systematic return of reports on results to field actors (outside of a bulletin). ",0.125,{"$f":"'Scoring criteria'!E125","v":3},"Section 9 question 25 and 26",3,{"$f":"((Tableau18[[#This Row],[Weigh]]*100)*Tableau18[[#This Row],[Score]])","v":37.5},{"$f":"((Tableau18[[#This Row],[Weigh]]*100)*F116)","v":37.5},{"$f":"IF(Tableau18[[#This Row],[Score]]<>\"NA\",Tableau18[[#This Row],[Maximum]]-Tableau18[[#This Row],[Priority (score + weigh)]],\"NA\")","v":0}]
[null,"9.F. Solid external communication policy",0.125,{"$f":"'Scoring criteria'!E127","v":3},"Section 9 question 24 and 32",3,{"$f":"((Tableau18[[#This Row],[Weigh]]*100)*Tableau18[[#This Row],[Score]])","v":37.5},{"$f":"((Tableau18[[#This Row],[Weigh]]*100)*F117)","v":37.5},{"$f":"IF(Tableau18[[#This Row],[Score]]<>\"NA\",Tableau18[[#This Row],[Maximum]]-Tableau18[[#This Row],[Priority (score + weigh)]],\"NA\")","v":0}]

{"sheet":"Feedback_output_2 (2)","index":5,"n_rows":115,"n_cols":9,"rows_kept":115,"cut":false,"hidden":false,"merged":[[52,1,52,3],[77,1,77,3],[96,1,96,3],[109,1,109,3],[4,1,4,3],[7,1,7,3],[9,1,9,3],[18,1,18,3],[29,1,29,3],[5,1,5,3]]}
[]
[]
[]
[]
[null,"Feedback for output 2"]
[null,"To get started click to classify the criteria. For each critical point, the criteria used are classified according to their weighs and their score.  In each table the first criteria need to be improve in priority"]
[]
[null,"Disease present"]
[]
[null,"Objectives"]
[null,"Criteria","Weigh","Score","Referencing question","Max","Priority (score + weigh)","Maximum","Missing points"]
[null,"6.A Appropriateness of surveillance procedures with the system's objectives",0.2,{"$f":"'Scoring criteria'!E86","v":0},"Section 5 (part 1) question 50, 48 and 49",3,{"$f":"((Tableau1220[[#This Row],[Weigh]]*100)*Tableau1220[[#This Row],[Score]])","v":0},{"$f":"((Tableau1220[[#This Row],[Weigh]]*100)*F12)","v":60},{"$f":"IF(Tableau1220[[#This Row],[Score]]<>\"NA\",Tableau1220[[#This Row],[Maximum]]-Tableau1220[[#This Row],[Priority (score + weigh)]],\"NA\")","v":60}]
[null,"1.D           Coherence of the diseases under surveillance with the sanitary situation (existing/exotic diseases or threats)",0.2,{"$f":"'Scoring criteria'!E18","v":3},"Section 1 question 3",3,{"$f":"((Tableau1220[[#This Row],[Weigh]]*100)*Tableau1220[[#This Row],[Score]])","v":60},{"$f":"((Tableau1220[[#This Row],[Weigh]]*100)*F13)","v":60},{"$f":"IF(Tableau1220[[#This Row],[Score]]<>\"NA\",Tableau1220[[#This Row],[Maximum]]-Tableau1220[[#This Row],[Priority (score + weigh)]],\"NA\")","v":0}]
[null,"1.C           Taking partners’ expectations into account",0.2,{"$f":"'Scoring criteria'!E17","v":3},"Section 1 question 4",3,{"$f":"((Tableau1220[[#This Row],[Weigh]]*100)*Tableau1220[[#This Row],[Score]])","v":60},{"$f":"((Tableau1220[[#This Row],[Weigh]]*100)*F14)","v":60},{"$f":"IF(Tableau1220[[#This Row],[Score]]<>\"NA\",Tableau1220[[#This Row],[Maximum]]-Tableau1220[[#This Row],[Priority (score + weigh)]],\"NA\")","v":0}]
[null,"1.A           Relevance of surveillance objectives",0.2,{"$f":"'Scoring criteria'!E15","v":3},"Section 1 question 1 and 3",3,{"$f":"((Tableau1220[[#This Row],[Weigh]]*100)*Tableau1220[[#This Row],[Score]])","v":60},{"$f":"((Tableau1220[[#This Row],[Weigh]]*100)*F15)","v":60},{"$f":"IF(Tableau1220[[#This Row],[Score]]<>\"NA\",Tableau1220[[#This Row],[Maximum]]-Tableau1220[[#This Row],[Priority (score + weigh)]],\"NA\")","v":0}]
[null,"1.B           Level of detail, accuracy, and formalization of objectives",0.2,{"$f":"'Scoring criteria'!E16","v":3},"Section 1 question 1 and 2",3,{"$f":"((Tableau1220[[#This Row],[Weigh]]*100)*Tableau1220[[#This Row],[Score]])","v":60},{"$f":"((Tableau1220[[#This Row],[Weigh]]*100)*F16)","v":60},{"$f":"IF(Tableau1220[[#This Row],[Score]]<>\"NA\",Tableau1220[[#This Row],[Maximum]]-Tableau1220[[#This Row],[Priority (score + weigh)]],\"NA\")","v":0}]
[]
[]
[null,"Sampling"]
[null,"Criteria","Weigh","Score","Referencing question","Max","Priority (score + weigh)","Maximun","Missing points"]
[null,"6.H Precision of sample under active (planned) surveillance",0.33300000000000002,{"$f":"'Scoring criteria'!E93","v":"NA"},"Section 3 (part 1) question 31, section 3 (part 3) question 2  section 4 table at the end of the section column b and c",3,{"$f":"((Tableau121421[[#This Row],[Weigh]]*100)*Tableau121421[[#This Row],[Score]])","v":{"$error":"#VALUE!"}},{"$f":"((Tableau121421[[#This Row],[Weigh]]*100)*F21)","v":99.9},{"$f":"IF(Tableau121421[[#This Row],[Score]]<>\"NA\",Tableau121421[[#This Row],[Maximun]]-Tableau121421[[#This Row],[Priority (score + weigh)]],\"NA\")","v":"NA"}]
[null,"6.G Representativeness of the populations targeted by sampling in active (planned) surveillance",7.1999999999999995E-2,{"$f":"'Scoring criteria'!E92","v":"NA"},"Section 5 (part 1) question 33 and section 5 (part 3) question 29",3,{"$f":"((Tableau121421[[#This Row],[Weigh]]*100)*Tableau121421[[#This Row],[Score]])","v":{"$error":"#VALUE!"}},{"$f":"((Tableau121421[[#This Row],[Weigh]]*100)*F22)","v":21.599999999999998},{"$f":"IF(Tableau121421[[#This Row],[Score]]<>\"NA\",Tableau121421[[#This Row],[Maximun]]-Tableau121421[[#This Row],[Priority (score + weigh)]],\"NA\")","v":"NA"}]
[null,"6.I Level of satisfaction of active (planned) surveillance completeness rate",0.114,{"$f":"'Scoring criteria'!E94","v":"NA"},"Section 5 (part 3) question 33 and 34",3,{"$f":"((Tableau121421[[#This Row],[Weigh]]*100)*Tableau121421[[#This Row],[Score]])","v":{"$error":"#VALUE!"}},{"$f":"((Tableau121421[[#This Row],[Weigh]]*100)*F23)","v":34.200000000000003},{"$f":"IF(Tableau121421[[#This Row],[Score]]<>\"NA\",Tableau121421[[#This Row],[Maximun]]-Tableau121421[[#This Row],[Priority (score + weigh)]],\"NA\")","v":"NA"}]
[null,"6.D Relevance and suitability of active (planned) surveillance protocols ",0.114,{"$f":"'Scoring criteria'!E89","v":1},"Section 5 (part 1) question 40, 42 and 41",3,{"$f":"((Tableau121421[[#This Row],[Weigh]]*100)*Tableau121421[[#This Row],[Score]])","v":11.4},{"$f":"((Tableau121421[[#This Row],[Weigh]]*100)*F24)","v":34.200000000000003},{"$f":"IF(Tableau121421[[#This Row],[Score]]<>\"NA\",Tableau121421[[#This Row],[Maximun]]-Tableau121421[[#This Row],[Priority (score + weigh)]],\"NA\")","v":22.800000000000004}]
[null,"3.G Exhaustiveness or representativeness of the field agents’ coverage of the target population",7.1999999999999995E-2,{"$f":"'Scoring criteria'!E42","v":2},"Section 3 (part 2) question 10, 14 and 16",3,{"$f":"((Tableau121421[[#This Row],[Weigh]]*100)*Tableau121421[[#This Row],[Score]])","v":14.399999999999999},{"$f":"((Tableau121421[[#This Row],[Weigh]]*100)*F25)","v":21.599999999999998},{"$f":"IF(Tableau121421[[#This Row],[Score]]<>\"NA\",Tableau121421[[#This Row],[Maximun]]-Tableau121421[[#This Row],[Priority (score + weigh)]],\"NA\")","v":7.1999999999999993}]
[null,"6.B Existence of passive (event-based) surveillance whose results are exhaustive or representative",0.28499999999999998,{"$f":"'Scoring criteria'!E87","v":3},"Section 5 (part 1) question 16 and 38",3,{"$f":"((Tableau121421[[#This Row],[Weigh]]*100)*Tableau121421[[#This Row],[Score]])","v":85.499999999999986},{"$f":"((Tableau121421[[#This Row],[Weigh]]*100)*F26)","v":85.499999999999986},{"$f":"IF(Tableau121421[[#This Row],[Score]]<>\"NA\",Tableau121421[[#This Row],[Maximun]]-Tableau121421[[#This Row],[Priority (score + weigh)]],\"NA\")","v":0}]
[null,"3.A Existence of formal intermediary units covering the entire territory",7.1999999999999995E-2,{"$f":"'Scoring criteria'!E36","v":3},"Section 3 (part 1) question 1, 8 and 5",3,{"$f":"((Tableau121421[[#This Row],[Weigh]]*100)*Tableau121421[[#This Row],[Score]])","v":21.599999999999998},{"$f":"((Tableau121421[[#This Row],[Weigh]]*100)*F27)","v":21.599999999999998},{"$f":"IF(Tableau121421[[#This Row],[Score]]<>\"NA\",Tableau121421[[#This Row],[Maximun]]-Tableau121421[[#This Row],[Priority (score + weigh)]],\"NA\")","v":0}]
[]
[]
[null,"Animation"]
[null,"Criteria","Weigh","Score","Referencing question","Max","Priority (Score + weigh)","Maximum","Missing points"]
[null,"6.C Existence of awareness building programs for data sources in a passive (event-based) network ",0.38300000000000001,{"$f":"'Scoring criteria'!E88","v":2},"Section 5 (part 1) question 61 and section 5 (part 3) question 23, 24 and 37",3,{"$f":"((Tableau12141222[[#This Row],[Weigh]]*100)*Tableau12141222[[#This Row],[Score]])","v":76.599999999999994},{"$f":"((Tableau12141222[[#This Row],[Weigh]]*100)*F32)","v":114.89999999999999},{"$f":"IF(Tableau12141222[[#This Row],[Score]]<>\"NA\",Tableau12141222[[#This Row],[Maximum]]-Tableau12141222[[#This Row],[Priority (Score + weigh)]],\"NA\")","v":38.299999999999997}]
[null,"8.B. Initial training implemented for all field agents when joining the system",0.13,{"$f":"'Scoring criteria'!E113","v":1},"Section 8 question 9 and 10",3,{"$f":"((Tableau12141222[[#This Row],[Weigh]]*100)*Tableau12141222[[#This Row],[Score]])","v":13},{"$f":"((Tableau12141222[[#This Row],[Weigh]]*100)*F33)","v":39},{"$f":"IF(Tableau12141222[[#This Row],[Score]]<>\"NA\",Tableau12141222[[#This Row],[Maximum]]-Tableau12141222[[#This Row],[Priority (Score + weigh)]],\"NA\")","v":26}]
[null,"2.A Existence of an operational management structure (central unit)",6.6000000000000003E-2,{"$f":"'Scoring criteria'!E24","v":0.5},"Section 2 question 7, 9, 10, 20 and 22",3,{"$f":"((Tableau12141222[[#This Row],[Weigh]]*100)*Tableau12141222[[#This Row],[Score]])","v":3.3000000000000003},{"$f":"((Tableau12141222[[#This Row],[Weigh]]*100)*F34)","v":19.8},{"$f":"IF(Tableau12141222[[#This Row],[Score]]<>\"NA\",Tableau12141222[[#This Row],[Maximum]]-Tableau12141222[[#This Row],[Priority (Score + weigh)]],\"NA\")","v":16.5}]
[null,"8.D. Regular advanced training",5.2999999999999999E-2,{"$f":"'Scoring criteria'!E115","v":0},"Section 8 question 14 and 20",3,{"$f":"((Tableau12141222[[#This Row],[Weigh]]*100)*Tableau12141222[[#This Row],[Score]])","v":0},{"$f":"((Tableau12141222[[#This Row],[Weigh]]*100)*F35)","v":15.899999999999999},{"$f":"IF(Tableau12141222[[#This Row],[Score]]<>\"NA\",Tableau12141222[[#This Row],[Maximum]]-Tableau12141222[[#This Row],[Priority (Score + weigh)]],\"NA\")","v":15.899999999999999}]
[null,"9.C. Regular dissemination of a relevant information bulletin",5.2999999999999999E-2,{"$f":"'Scoring criteria'!E124","v":1.5},"Section 9 question 33, 34, 35, 36 and 40",3,{"$f":"((Tableau12141222[[#This Row],[Weigh]]*100)*Tableau12141222[[#This Row],[Score]])","v":7.9499999999999993},{"$f":"((Tableau12141222[[#This Row],[Weigh]]*100)*F36)","v":15.899999999999999},{"$f":"IF(Tableau12141222[[#This Row],[Score]]<>\"NA\",Tableau12141222[[#This Row],[Maximum]]-Tableau12141222[[#This Row],[Priority (Score + weigh)]],\"NA\")","v":7.9499999999999993}]
[null,"2.C Existence of a scientific and technical committee for the system",6.6000000000000003E-2,{"$f":"'Scoring criteria'!E26","v":2},"Section 2 question 41, 45, 46, 48, 52 and 54",3,{"$f":"((Tableau12141222[[#This Row],[Weigh]]*100)*Tableau12141222[[#This Row],[Score]])","v":13.200000000000001},{"$f":"((Tableau12141222[[#This Row],[Weigh]]*100)*F37)","v":19.8},{"$f":"IF(Tableau12141222[[#This Row],[Score]]<>\"NA\",Tableau12141222[[#This Row],[Maximum]]-Tableau12141222[[#This Row],[Priority (Score + weigh)]],\"NA\")","v":6.6}]
[null,"3.D Harmonization of intermediary units’ activities",1.2E-2,{"$f":"'Scoring criteria'!E39","v":0},"section 3 (part 1) question 12, 13 and 14",3,{"$f":"((Tableau12141222[[#This Row],[Weigh]]*100)*Tableau12141222[[#This Row],[Score]])","v":0},{"$f":"((Tableau12141222[[#This Row],[Weigh]]*100)*F38)","v":3.5999999999999996},{"$f":"IF(Tableau12141222[[#This Row],[Score]]<>\"NA\",Tableau12141222[[#This Row],[Maximum]]-Tableau12141222[[#This Row],[Priority (Score + weigh)]],\"NA\")","v":3.5999999999999996}]
[null,"2.B Existence of an operational steering structure that is representative of the partners (steering committee)",1.2E-2,{"$f":"'Scoring criteria'!E25","v":1},"Section 2 question 28/29, 31, 34, 37, 38 and 39",3,{"$f":"((Tableau12141222[[#This Row],[Weigh]]*100)*Tableau12141222[[#This Row],[Score]])","v":1.2},{"$f":"((Tableau12141222[[#This Row],[Weigh]]*100)*F39)","v":3.5999999999999996},{"$f":"IF(Tableau12141222[[#This Row],[Score]]<>\"NA\",Tableau12141222[[#This Row],[Maximum]]-Tableau12141222[[#This Row],[Priority (Score + weigh)]],\"NA\")","v":2.3999999999999995}]
[null,"7.C. Designated staff available and trained in data entry, management and analysis.",1.2E-2,{"$f":"'Scoring criteria'!E102","v":1},"Section 7 question 52",3,{"$f":"((Tableau12141222[[#This Row],[Weigh]]*100)*Tableau12141222[[#This Row],[Score]])","v":1.2},{"$f":"((Tableau12141222[[#This Row],[Weigh]]*100)*F40)","v":3.5999999999999996},{"$f":"IF(Tableau12141222[[#This Row],[Score]]<>\"NA\",Tableau12141222[[#This Row],[Maximum]]-Tableau12141222[[#This Row],[Priority (Score + weigh)]],\"NA\")","v":2.3999999999999995}]
[null,"8.A. Adequate skill level in epidemiology of members of the central unit",1.2E-2,{"$f":"'Scoring criteria'!E112","v":1},"Section 8 question 2 and 4",3,{"$f":"((Tableau12141222[[#This Row],[Weigh]]*100)*Tableau12141222[[#This Row],[Score]])","v":1.2},{"$f":"((Tableau12141222[[#This Row],[Weigh]]*100)*F41)","v":3.5999999999999996},{"$f":"IF(Tableau12141222[[#This Row],[Score]]<>\"NA\",Tableau12141222[[#This Row],[Maximum]]-Tableau12141222[[#This Row],[Priority (Score + weigh)]],\"NA\")","v":2.3999999999999995}]
[null,"2.F Supervision of intermediary units by the central level",1.2E-2,{"$f":"'Scoring criteria'!E29","v":2},"Section 2 question 68, 70 and 73",3,{"$f":"((Tableau12141222[[#This Row],[Weigh]]*100)*Tableau12141222[[#This Row],[Score]])","v":2.4},{"$f":"((Tableau12141222[[#This Row],[Weigh]]*100)*F42)","v":3.5999999999999996},{"$f":"IF(Tableau12141222[[#This Row],[Score]]<>\"NA\",Tableau12141222[[#This Row],[Maximum]]-Tableau12141222[[#This Row],[Priority (Score + weigh)]],\"NA\")","v":1.1999999999999997}]
[null,"3.F Existence of coordination meetings at the intermediate level",1.2E-2,{"$f":"'Scoring criteria'!E41","v":2},"Section 3 (part 1) question 18, 21, 28, 30 and 32",3,{"$f":"((Tableau12141222[[#This Row],[Weigh]]*100)*Tableau12141222[[#This Row],[Score]])","v":2.4},{"$f":"((Tableau12141222[[#This Row],[Weigh]]*100)*F43)","v":3.5999999999999996},{"$f":"IF(Tableau12141222[[#This Row],[Score]]<>\"NA\",Tableau12141222[[#This Row],[Maximum]]-Tableau12141222[[#This Row],[Priority (Score + weigh)]],\"NA\")","v":1.1999999999999997}]
[null,"4.F Existence of an investigation team to support field agents",1.2E-2,{"$f":"'Scoring criteria'!E54","v":2},"Section 4 question 52 and 53",3,{"$f":"((Tableau12141222[[#This Row],[Weigh]]*100)*Tableau12141222[[#This Row],[Score]])","v":2.4},{"$f":"((Tableau12141222[[#This Row],[Weigh]]*100)*F44)","v":3.5999999999999996},{"$f":"IF(Tableau12141222[[#This Row],[Score]]<>\"NA\",Tableau12141222[[#This Row],[Maximum]]-Tableau12141222[[#This Row],[Priority (Score + weigh)]],\"NA\")","v":1.1999999999999997}]
[null,"2.E Frequency of meetings of the central coordinating body",1.2E-2,{"$f":"'Scoring criteria'!E28","v":2},"Section 2 question 61, 62, 65 and 67",3,{"$f":"((Tableau12141222[[#This Row],[Weigh]]*100)*Tableau12141222[[#This Row],[Score]])","v":2.4},{"$f":"((Tableau12141222[[#This Row],[Weigh]]*100)*F45)","v":3.5999999999999996},{"$f":"IF(Tableau12141222[[#This Row],[Score]]<>\"NA\",Tableau12141222[[#This Row],[Maximum]]-Tableau12141222[[#This Row],[Priority (Score + weigh)]],\"NA\")","v":1.1999999999999997}]
[null,"3.C Implementation of supervision by the intermediary level\n",1.2E-2,{"$f":"'Scoring criteria'!E38","v":2.75},"Section 3 (part 2) question 5, 7 and 9",3,{"$f":"((Tableau12141222[[#This Row],[Weigh]]*100)*Tableau12141222[[#This Row],[Score]])","v":3.3},{"$f":"((Tableau12141222[[#This Row],[Weigh]]*100)*F46)","v":3.5999999999999996},{"$f":"IF(Tableau12141222[[#This Row],[Score]]<>\"NA\",Tableau12141222[[#This Row],[Maximum]]-Tableau12141222[[#This Row],[Priority (Score + weigh)]],\"NA\")","v":0.29999999999999982}]
[null,"9.D. Systematic return of reports on results to field actors (outside of a bulletin). ",5.2999999999999999E-2,{"$f":"'Scoring criteria'!E125","v":3},"Section 9 question 25 and 26",3,{"$f":"((Tableau12141222[[#This Row],[Weigh]]*100)*Tableau12141222[[#This Row],[Score]])","v":15.899999999999999},{"$f":"((Tableau12141222[[#This Row],[Weigh]]*100)*F47)","v":15.899999999999999},{"$f":"IF(Tableau12141222[[#This Row],[Score]]<>\"NA\",Tableau12141222[[#This Row],[Maximum]]-Tableau12141222[[#This Row],[Priority (Score + weigh)]],\"NA\")","v":0}]
[null,"4.A Effective integration of laboratories in the surveillance system",5.2999999999999999E-2,{"$f":"'Scoring criteria'!E49","v":3},"Section 4 question 1 and 2",3,{"$f":"((Tableau12141222[[#This Row],[Weigh]]*100)*Tableau12141222[[#This Row],[Score]])","v":15.899999999999999},{"$f":"((Tableau12141222[[#This Row],[Weigh]]*100)*F48)","v":15.899999999999999},{"$f":"IF(Tableau12141222[[#This Row],[Score]]<>\"NA\",Tableau12141222[[#This Row],[Maximum]]-Tableau12141222[[#This Row],[Priority (Score + weigh)]],\"NA\")","v":0}]
[null,"3.A Existence of formal intermediary units covering the entire territory",1.2E-2,{"$f":"'Scoring criteria'!E36","v":3},"Section 3 (part 1) question 1, 8 and 5",3,{"$f":"((Tableau12141222[[#This Row],[Weigh]]*100)*Tableau12141222[[#This Row],[Score]])","v":3.5999999999999996},{"$f":"((Tableau12141222[[#This Row],[Weigh]]*100)*F49)","v":3.5999999999999996},{"$f":"IF(Tableau12141222[[#This Row],[Score]]<>\"NA\",Tableau12141222[[#This Row],[Maximum]]-Tableau12141222[[#This Row],[Priority (Score + weigh)]],\"NA\")","v":0}]
[null,"3.B Active role of intermediary units in the functioning of the system (validation, management, feedback)",1.2E-2,{"$f":"'Scoring criteria'!E37","v":3},"Section 3 (part 2) question 1",3,{"$f":"((Tableau12141222[[#This Row],[Weigh]]*100)*Tableau12141222[[#This Row],[Score]])","v":3.5999999999999996},{"$f":"((Tableau12141222[[#This Row],[Weigh]]*100)*F50)","v":3.5999999999999996},{"$f":"IF(Tableau12141222[[#This Row],[Score]]<>\"NA\",Tableau12141222[[#This Row],[Maximum]]-Tableau12141222[[#This Row],[Priority (Score + weigh)]],\"NA\")","v":0}]
[]
[]
[null,"Tools"]
[null,"Criteria","Weigh","Score","Referencing question","Max","Priority (score + weigh)","Colonne1","Missing points"]
[null,"8.D. Regular advanced training",5.2999999999999999E-2,{"$f":"'Scoring criteria'!E115","v":0},"Section 8 question 14 and 20",3,{"$f":"((Tableau1214121624[[#This Row],[Weigh]]*100)*Tableau1214121624[[#This Row],[Score]])","v":0},{"$f":"((Tableau1214121624[[#This Row],[Weigh]]*100)*F55)","v":15.899999999999999},{"$f":"IF(Tableau1214121624[[#This Row],[Score]]<>\"NA\",Tableau1214121624[[#This Row],[Colonne1]]-Tableau1214121624[[#This Row],[Priority (score + weigh)]],\"NA\")","v":15.899999999999999}]
[null,"4.L Analysis deadlines at the laboratory (formalization, standardization, verification, transfer of results to the central unit)",0.05,{"$f":"'Scoring criteria'!E60","v":0},"Section 4 table at the end of the section column j and k and question 20 and 47",3,{"$f":"((Tableau1214121624[[#This Row],[Weigh]]*100)*Tableau1214121624[[#This Row],[Score]])","v":0},{"$f":"((Tableau1214121624[[#This Row],[Weigh]]*100)*F56)","v":15},{"$f":"IF(Tableau1214121624[[#This Row],[Score]]<>\"NA\",Tableau1214121624[[#This Row],[Colonne1]]-Tableau1214121624[[#This Row],[Priority (score + weigh)]],\"NA\")","v":15}]
[null,"8.B. Initial training implemented for all field agents when joining the system",5.2999999999999999E-2,{"$f":"'Scoring criteria'!E113","v":1},"Section 8 question 9 and 10",3,{"$f":"((Tableau1214121624[[#This Row],[Weigh]]*100)*Tableau1214121624[[#This Row],[Score]])","v":5.3},{"$f":"((Tableau1214121624[[#This Row],[Weigh]]*100)*F57)","v":15.899999999999999},{"$f":"IF(Tableau1214121624[[#This Row],[Score]]<>\"NA\",Tableau1214121624[[#This Row],[Colonne1]]-Tableau1214121624[[#This Row],[Priority (score + weigh)]],\"NA\")","v":10.599999999999998}]
[null,"4.H Sensitivity of diagnostic techniques",0.05,{"$f":"'Scoring criteria'!E56","v":1.5},"Section 4 table at the end of the section column b",3,{"$f":"((Tableau1214121624[[#This Row],[Weigh]]*100)*Tableau1214121624[[#This Row],[Score]])","v":7.5},{"$f":"((Tableau1214121624[[#This Row],[Weigh]]*100)*F58)","v":15},{"$f":"IF(Tableau1214121624[[#This Row],[Score]]<>\"NA\",Tableau1214121624[[#This Row],[Colonne1]]-Tableau1214121624[[#This Row],[Priority (score + weigh)]],\"NA\")","v":7.5}]
[null,"5.E Specificity of the case or threat definition",2.5000000000000001E-2,{"$f":"'Scoring criteria'!E71","v":1.5},"Section 5 question 17",3,{"$f":"((Tableau1214121624[[#This Row],[Weigh]]*100)*Tableau1214121624[[#This Row],[Score]])","v":3.75},{"$f":"((Tableau1214121624[[#This Row],[Weigh]]*100)*F59)","v":7.5},{"$f":"IF(Tableau1214121624[[#This Row],[Score]]<>\"NA\",Tableau1214121624[[#This Row],[Colonne1]]-Tableau1214121624[[#This Row],[Priority (score + weigh)]],\"NA\")","v":3.75}]
[null,"5.A Existence of a formalized surveillance protocol for each disease or threat under surveillance",2.8000000000000001E-2,{"$f":"'Scoring criteria'!E67","v":2},"Section 5 (part 1) question 1 and 2 to 13",3,{"$f":"((Tableau1214121624[[#This Row],[Weigh]]*100)*Tableau1214121624[[#This Row],[Score]])","v":5.6000000000000005},{"$f":"((Tableau1214121624[[#This Row],[Weigh]]*100)*F60)","v":8.4},{"$f":"IF(Tableau1214121624[[#This Row],[Score]]<>\"NA\",Tableau1214121624[[#This Row],[Colonne1]]-Tableau1214121624[[#This Row],[Priority (score + weigh)]],\"NA\")","v":2.8}]
[null,"8.C. Objectives and contents of initial training of system field actors adequate for operational surveillance needs",5.2999999999999999E-2,{"$f":"'Scoring criteria'!E114","v":2.5},"Section 8 question 11",3,{"$f":"((Tableau1214121624[[#This Row],[Weigh]]*100)*Tableau1214121624[[#This Row],[Score]])","v":13.25},{"$f":"((Tableau1214121624[[#This Row],[Weigh]]*100)*F61)","v":15.899999999999999},{"$f":"IF(Tableau1214121624[[#This Row],[Score]]<>\"NA\",Tableau1214121624[[#This Row],[Colonne1]]-Tableau1214121624[[#This Row],[Priority (score + weigh)]],\"NA\")","v":2.6499999999999986}]
[null,"5.F Simplicity of the case or threat definition",2.5000000000000001E-2,{"$f":"'Scoring criteria'!E72","v":2},"Section 5 (part 2 and 3)  question 1",3,{"$f":"((Tableau1214121624[[#This Row],[Weigh]]*100)*Tableau1214121624[[#This Row],[Score]])","v":5},{"$f":"((Tableau1214121624[[#This Row],[Weigh]]*100)*F62)","v":7.5},{"$f":"IF(Tableau1214121624[[#This Row],[Score]]<>\"NA\",Tableau1214121624[[#This Row],[Colonne1]]-Tableau1214121624[[#This Row],[Priority (score + weigh)]],\"NA\")","v":2.5}]
[null,"5.H Relevance of collected  samples",2.8000000000000001E-2,{"$f":"'Scoring criteria'!E74","v":2.5},"Section 5 (part 1) question 24, Section 5 (part 2) question 9 Section 5 (part 3) Quesstion 14 section 1 question 1 and 3",3,{"$f":"((Tableau1214121624[[#This Row],[Weigh]]*100)*Tableau1214121624[[#This Row],[Score]])","v":7.0000000000000009},{"$f":"((Tableau1214121624[[#This Row],[Weigh]]*100)*F63)","v":8.4},{"$f":"IF(Tableau1214121624[[#This Row],[Score]]<>\"NA\",Tableau1214121624[[#This Row],[Colonne1]]-Tableau1214121624[[#This Row],[Priority (score + weigh)]],\"NA\")","v":1.3999999999999995}]
[null,"4.J Control of laboratory reagents",0.2,{"$f":"'Scoring criteria'!E58","v":3},"Section 4 question 23 and 51",3,{"$f":"((Tableau1214121624[[#This Row],[Weigh]]*100)*Tableau1214121624[[#This Row],[Score]])","v":60},{"$f":"((Tableau1214121624[[#This Row],[Weigh]]*100)*F64)","v":60},{"$f":"IF(Tableau1214121624[[#This Row],[Score]]<>\"NA\",Tableau1214121624[[#This Row],[Colonne1]]-Tableau1214121624[[#This Row],[Priority (score + weigh)]],\"NA\")","v":0}]
[null,"4.D Quality of the standardization of work between different laboratories",0.05,{"$f":"'Scoring criteria'!E52","v":3},"Section 4 question 3, 21, 48 and 49",3,{"$f":"((Tableau1214121624[[#This Row],[Weigh]]*100)*Tableau1214121624[[#This Row],[Score]])","v":15},{"$f":"((Tableau1214121624[[#This Row],[Weigh]]*100)*F65)","v":15},{"$f":"IF(Tableau1214121624[[#This Row],[Score]]<>\"NA\",Tableau1214121624[[#This Row],[Colonne1]]-Tableau1214121624[[#This Row],[Priority (score + weigh)]],\"NA\")","v":0}]
[null,"4.G Relevance of diagnostic techniques",0.05,{"$f":"'Scoring criteria'!E55","v":3},"Section 4 question 54, 55 and 56",3,{"$f":"((Tableau1214121624[[#This Row],[Weigh]]*100)*Tableau1214121624[[#This Row],[Score]])","v":15},{"$f":"((Tableau1214121624[[#This Row],[Weigh]]*100)*F66)","v":15},{"$f":"IF(Tableau1214121624[[#This Row],[Score]]<>\"NA\",Tableau1214121624[[#This Row],[Colonne1]]-Tableau1214121624[[#This Row],[Priority (score + weigh)]],\"NA\")","v":0}]
[null,"4.A Effective integration of laboratories in the surveillance system",0.05,{"$f":"'Scoring criteria'!E49","v":3},"Section 4 question 1 and 2",3,{"$f":"((Tableau1214121624[[#This Row],[Weigh]]*100)*Tableau1214121624[[#This Row],[Score]])","v":15},{"$f":"((Tableau1214121624[[#This Row],[Weigh]]*100)*F67)","v":15},{"$f":"IF(Tableau1214121624[[#This Row],[Score]]<>\"NA\",Tableau1214121624[[#This Row],[Colonne1]]-Tableau1214121624[[#This Row],[Priority (score + weigh)]],\"NA\")","v":0}]
[null,"4.C Application of Quality Assurance for the tests undertaken",0.05,{"$f":"'Scoring criteria'!E51","v":3},"Section 4 table at the end of the section column l",3,{"$f":"((Tableau1214121624[[#This Row],[Weigh]]*100)*Tableau1214121624[[#This Row],[Score]])","v":15},{"$f":"((Tableau1214121624[[#This Row],[Weigh]]*100)*F68)","v":15},{"$f":"IF(Tableau1214121624[[#This Row],[Score]]<>\"NA\",Tableau1214121624[[#This Row],[Colonne1]]-Tableau1214121624[[#This Row],[Priority (score + weigh)]],\"NA\")","v":0}]
[null,"4.E Proportion of tests submitted to inter-laboratory trials",0.05,{"$f":"'Scoring criteria'!E53","v":3},"Section 4 table at the end of the section column m",3,{"$f":"((Tableau1214121624[[#This Row],[Weigh]]*100)*Tableau1214121624[[#This Row],[Score]])","v":15},{"$f":"((Tableau1214121624[[#This Row],[Weigh]]*100)*F69)","v":15},{"$f":"IF(Tableau1214121624[[#This Row],[Score]]<>\"NA\",Tableau1214121624[[#This Row],[Colonne1]]-Tableau1214121624[[#This Row],[Priority (score + weigh)]],\"NA\")","v":0}]
[null,"5.J Quality of samples collected",2.8000000000000001E-2,{"$f":"'Scoring criteria'!E76","v":3},"Section 5 (part 1) question 28",3,{"$f":"((Tableau1214121624[[#This Row],[Weigh]]*100)*Tableau1214121624[[#This Row],[Score]])","v":8.4},{"$f":"((Tableau1214121624[[#This Row],[Weigh]]*100)*F70)","v":8.4},{"$f":"IF(Tableau1214121624[[#This Row],[Score]]<>\"NA\",Tableau1214121624[[#This Row],[Colonne1]]-Tableau1214121624[[#This Row],[Priority (score + weigh)]],\"NA\")","v":0}]
[null,"5.D Sensitivity of the case or threat definition",2.5000000000000001E-2,{"$f":"'Scoring criteria'!E70","v":3},"Section 5 question 16",3,{"$f":"((Tableau1214121624[[#This Row],[Weigh]]*100)*Tableau1214121624[[#This Row],[Score]])","v":7.5},{"$f":"((Tableau1214121624[[#This Row],[Weigh]]*100)*F71)","v":7.5},{"$f":"IF(Tableau1214121624[[#This Row],[Score]]<>\"NA\",Tableau1214121624[[#This Row],[Colonne1]]-Tableau1214121624[[#This Row],[Priority (score + weigh)]],\"NA\")","v":0}]
[null,"4.M Quality of results delivered",0.05,{"$f":"'Scoring criteria'!E61","v":3},"Section 4 question 58 and 59",3,{"$f":"((Tableau1214121624[[#This Row],[Weigh]]*100)*Tableau1214121624[[#This Row],[Score]])","v":15},{"$f":"((Tableau1214121624[[#This Row],[Weigh]]*100)*F72)","v":15},{"$f":"IF(Tableau1214121624[[#This Row],[Score]]<>\"NA\",Tableau1214121624[[#This Row],[Colonne1]]-Tableau1214121624[[#This Row],[Priority (score + weigh)]],\"NA\")","v":0}]
[null,"5.B Standardization of data collected",2.5000000000000001E-2,{"$f":"'Scoring criteria'!E68","v":3},"Section 5 (part 1) question 14, 19, 20, 22 and 23",3,{"$f":"((Tableau1214121624[[#This Row],[Weigh]]*100)*Tableau1214121624[[#This Row],[Score]])","v":7.5},{"$f":"((Tableau1214121624[[#This Row],[Weigh]]*100)*F73)","v":7.5},{"$f":"IF(Tableau1214121624[[#This Row],[Score]]<>\"NA\",Tableau1214121624[[#This Row],[Colonne1]]-Tableau1214121624[[#This Row],[Priority (score + weigh)]],\"NA\")","v":0}]
[null,"5.C Relevance of measurement tools (excluding laboratory tools)",2.5000000000000001E-2,{"$f":"'Scoring criteria'!E69","v":3},"Section 5 (part 2) question 6, Section 5 (part 3) question 9 and section 1 question 1 ",3,{"$f":"((Tableau1214121624[[#This Row],[Weigh]]*100)*Tableau1214121624[[#This Row],[Score]])","v":7.5},{"$f":"((Tableau1214121624[[#This Row],[Weigh]]*100)*F74)","v":7.5},{"$f":"IF(Tableau1214121624[[#This Row],[Score]]<>\"NA\",Tableau1214121624[[#This Row],[Colonne1]]-Tableau1214121624[[#This Row],[Priority (score + weigh)]],\"NA\")","v":0}]
[null,"5.I Standardization of collected samples",2.8000000000000001E-2,{"$f":"'Scoring criteria'!E75","v":3},"Section 5 (part 1) question 25 and 26",3,{"$f":"((Tableau1214121624[[#This Row],[Weigh]]*100)*Tableau1214121624[[#This Row],[Score]])","v":8.4},{"$f":"((Tableau1214121624[[#This Row],[Weigh]]*100)*F75)","v":8.4},{"$f":"IF(Tableau1214121624[[#This Row],[Score]]<>\"NA\",Tableau1214121624[[#This Row],[Colonne1]]-Tableau1214121624[[#This Row],[Priority (score + weigh)]],\"NA\")","v":0}]
[]
[]
[null,"Collection and circulation of data"]
[null,"Criteria","Weigh","Score","Referencing question","Max","Priority (score + weigh)","Colonne1","Missing points"]
[null,"4.B Adequacy of human, material, and financial resources for diagnostic needs",7.0999999999999994E-2,{"$f":"'Scoring criteria'!E50","v":0},"Section 4 question 8, 9, 10, 35, 36 and 37",3,{"$f":"((Tableau1214121725[[#This Row],[Weigh]]*100)*Tableau1214121725[[#This Row],[Score]])","v":0},{"$f":"((Tableau1214121725[[#This Row],[Weigh]]*100)*F80)","v":21.299999999999997},{"$f":"IF(Tableau1214121725[[#This Row],[Score]]<>\"NA\",Tableau1214121725[[#This Row],[Colonne1]]-Tableau1214121725[[#This Row],[Priority (score + weigh)]],\"NA\")","v":21.299999999999997}]
[null,"7.B Data input interval in accordance with the objectives and use of system results",7.0999999999999994E-2,{"$f":"'Scoring criteria'!E101","v":0},"Section 7 question 18",3,{"$f":"((Tableau1214121725[[#This Row],[Weigh]]*100)*Tableau1214121725[[#This Row],[Score]])","v":0},{"$f":"((Tableau1214121725[[#This Row],[Weigh]]*100)*F81)","v":21.299999999999997},{"$f":"IF(Tableau1214121725[[#This Row],[Score]]<>\"NA\",Tableau1214121725[[#This Row],[Colonne1]]-Tableau1214121725[[#This Row],[Priority (score + weigh)]],\"NA\")","v":21.299999999999997}]
[null,"4.L Analysis deadlines at the laboratory (formalization, standardization, verification, transfer of results to the central unit)",7.0999999999999994E-2,{"$f":"'Scoring criteria'!E60","v":0},"Section 4 table at the end of the section column j and k and question 20 and 47",3,{"$f":"((Tableau1214121725[[#This Row],[Weigh]]*100)*Tableau1214121725[[#This Row],[Score]])","v":0},{"$f":"((Tableau1214121725[[#This Row],[Weigh]]*100)*F82)","v":21.299999999999997},{"$f":"IF(Tableau1214121725[[#This Row],[Score]]<>\"NA\",Tableau1214121725[[#This Row],[Colonne1]]-Tableau1214121725[[#This Row],[Priority (score + weigh)]],\"NA\")","v":21.299999999999997}]
[null,"3.D Harmonization of intermediary units’ activities",6.2E-2,{"$f":"'Scoring criteria'!E39","v":0},"section 3 (part 1) question 12, 13 and 14",3,{"$f":"((Tableau1214121725[[#This Row],[Weigh]]*100)*Tableau1214121725[[#This Row],[Score]])","v":0},{"$f":"((Tableau1214121725[[#This Row],[Weigh]]*100)*F83)","v":18.600000000000001},{"$f":"IF(Tableau1214121725[[#This Row],[Score]]<>\"NA\",Tableau1214121725[[#This Row],[Colonne1]]-Tableau1214121725[[#This Row],[Priority (score + weigh)]],\"NA\")","v":18.600000000000001}]
[null,"8.D. Regular advanced training",6.2E-2,{"$f":"'Scoring criteria'!E115","v":0},"Section 8 question 14 and 20",3,{"$f":"((Tableau1214121725[[#This Row],[Weigh]]*100)*Tableau1214121725[[#This Row],[Score]])","v":0},{"$f":"((Tableau1214121725[[#This Row],[Weigh]]*100)*F84)","v":18.600000000000001},{"$f":"IF(Tableau1214121725[[#This Row],[Score]]<>\"NA\",Tableau1214121725[[#This Row],[Colonne1]]-Tableau1214121725[[#This Row],[Priority (score + weigh)]],\"NA\")","v":18.600000000000001}]
[null,"2.A Existence of an operational management structure (central unit)",6.2E-2,{"$f":"'Scoring criteria'!E24","v":0.5},"Section 2 question 7, 9, 10, 20 and 22",3,{"$f":"((Tableau1214121725[[#This Row],[Weigh]]*100)*Tableau1214121725[[#This Row],[Score]])","v":3.1},{"$f":"((Tableau1214121725[[#This Row],[Weigh]]*100)*F85)","v":18.600000000000001},{"$f":"IF(Tableau1214121725[[#This Row],[Score]]<>\"NA\",Tableau1214121725[[#This Row],[Colonne1]]-Tableau1214121725[[#This Row],[Priority (score + weigh)]],\"NA\")","v":15.500000000000002}]
[null,"8.B. Initial training implemented for all field agents when joining the system",6.2E-2,{"$f":"'Scoring criteria'!E113","v":1},"Section 8 question 9 and 10",3,{"$f":"((Tableau1214121725[[#This Row],[Weigh]]*100)*Tableau1214121725[[#This Row],[Score]])","v":6.2},{"$f":"((Tableau1214121725[[#This Row],[Weigh]]*100)*F86)","v":18.600000000000001},{"$f":"IF(Tableau1214121725[[#This Row],[Score]]<>\"NA\",Tableau1214121725[[#This Row],[Colonne1]]-Tableau1214121725[[#This Row],[Priority (score + weigh)]],\"NA\")","v":12.400000000000002}]
[null,"5.L Simplicity of the notification procedure",7.0999999999999994E-2,{"$f":"'Scoring criteria'!E78","v":2},"Section 5 (part 1) question 36, section 5 (part 2) question 16, 4 and 15 and Section 5 (part 3) question 7, 19 and 20",3,{"$f":"((Tableau1214121725[[#This Row],[Weigh]]*100)*Tableau1214121725[[#This Row],[Score]])","v":14.2},{"$f":"((Tableau1214121725[[#This Row],[Weigh]]*100)*F87)","v":21.299999999999997},{"$f":"IF(Tableau1214121725[[#This Row],[Score]]<>\"NA\",Tableau1214121725[[#This Row],[Colonne1]]-Tableau1214121725[[#This Row],[Priority (score + weigh)]],\"NA\")","v":7.0999999999999979}]
[null,"3.F Existence of coordination meetings at the intermediate level",6.2E-2,{"$f":"'Scoring criteria'!E41","v":2},"Section 3 (part 1) question 18, 21, 28, 30 and 32",3,{"$f":"((Tableau1214121725[[#This Row],[Weigh]]*100)*Tableau1214121725[[#This Row],[Score]])","v":12.4},{"$f":"((Tableau1214121725[[#This Row],[Weigh]]*100)*F88)","v":18.600000000000001},{"$f":"IF(Tableau1214121725[[#This Row],[Score]]<>\"NA\",Tableau1214121725[[#This Row],[Colonne1]]-Tableau1214121725[[#This Row],[Priority (score + weigh)]],\"NA\")","v":6.2000000000000011}]
[null,"8.C. Objectives and contents of initial training of system field actors adequate for operational surveillance needs",6.2E-2,{"$f":"'Scoring criteria'!E114","v":2.5},"Section 8 question 11",3,{"$f":"((Tableau1214121725[[#This Row],[Weigh]]*100)*Tableau1214121725[[#This Row],[Score]])","v":15.5},{"$f":"((Tableau1214121725[[#This Row],[Weigh]]*100)*F89)","v":18.600000000000001},{"$f":"IF(Tableau1214121725[[#This Row],[Score]]<>\"NA\",Tableau1214121725[[#This Row],[Colonne1]]-Tableau1214121725[[#This Row],[Priority (score + weigh)]],\"NA\")","v":3.1000000000000014}]
[null,"9.B. Return of individual test results to field actors",7.0999999999999994E-2,{"$f":"'Scoring criteria'!E123","v":3},"Section 9 question 14",3,{"$f":"((Tableau1214121725[[#This Row],[Weigh]]*100)*Tableau1214121725[[#This Row],[Score]])","v":21.299999999999997},{"$f":"((Tableau1214121725[[#This Row],[Weigh]]*100)*F90)","v":21.299999999999997},{"$f":"IF(Tableau1214121725[[#This Row],[Score]]<>\"NA\",Tableau1214121725[[#This Row],[Colonne1]]-Tableau1214121725[[#This Row],[Priority (score + weigh)]],\"NA\")","v":0}]
[null,"9.E. Presence of a communications system organized transversally and vertically between field actors (mail, web, telephone…)",7.0999999999999994E-2,{"$f":"'Scoring criteria'!E126","v":3},"Section 9 question 13 and 16 ",3,{"$f":"((Tableau1214121725[[#This Row],[Weigh]]*100)*Tableau1214121725[[#This Row],[Score]])","v":21.299999999999997},{"$f":"((Tableau1214121725[[#This Row],[Weigh]]*100)*F91)","v":21.299999999999997},{"$f":"IF(Tableau1214121725[[#This Row],[Score]]<>\"NA\",Tableau1214121725[[#This Row],[Colonne1]]-Tableau1214121725[[#This Row],[Priority (score + weigh)]],\"NA\")","v":0}]
[null,"5.J Quality of samples collected",6.2E-2,{"$f":"'Scoring criteria'!E76","v":3},"Section 5 (part 1) question 28",3,{"$f":"((Tableau1214121725[[#This Row],[Weigh]]*100)*Tableau1214121725[[#This Row],[Score]])","v":18.600000000000001},{"$f":"((Tableau1214121725[[#This Row],[Weigh]]*100)*F92)","v":18.600000000000001},{"$f":"IF(Tableau1214121725[[#This Row],[Score]]<>\"NA\",Tableau1214121725[[#This Row],[Colonne1]]-Tableau1214121725[[#This Row],[Priority (score + weigh)]],\"NA\")","v":0}]
[null,"5.G Quality of the filling out of investigation forms",6.2E-2,{"$f":"'Scoring criteria'!E73","v":3},"Section 5 (part 1) question 19 and 21",3,{"$f":"((Tableau1214121725[[#This Row],[Weigh]]*100)*Tableau1214121725[[#This Row],[Score]])","v":18.600000000000001},{"$f":"((Tableau1214121725[[#This Row],[Weigh]]*100)*F93)","v":18.600000000000001},{"$f":"IF(Tableau1214121725[[#This Row],[Score]]<>\"NA\",Tableau1214121725[[#This Row],[Colonne1]]-Tableau1214121725[[#This Row],[Priority (score + weigh)]],\"NA\")","v":0}]
[null,"5.K Respect of the interval between the detection of a case or threat and the delivery of results",7.0999999999999994E-2,{"$f":"'Scoring criteria'!E77","v":3},"Section 5 (part 1) question31, 32, 33 and 34",3,{"$f":"((Tableau1214121725[[#This Row],[Weigh]]*100)*Tableau1214121725[[#This Row],[Score]])","v":21.299999999999997},{"$f":"((Tableau1214121725[[#This Row],[Weigh]]*100)*F94)","v":21.299999999999997},{"$f":"IF(Tableau1214121725[[#This Row],[Score]]<>\"NA\",Tableau1214121725[[#This Row],[Colonne1]]-Tableau1214121725[[#This Row],[Priority (score + weigh)]],\"NA\")","v":0}]
[]
[]
[null,"Processing and interpretation"]
[null,"Criteria","Weigh","Score","Referencing question","Max","Priority (score + weigh)","Colonne1","Missing points"]
[null,"7.G. Exploitation of data fits the needs of the system (if possible regular and multi-disciplinary)",0.16,{"$f":"'Scoring criteria'!E106","v":0},"Section 7 question 31, 33 and 34",3,{"$f":"((Tableau1726[[#This Row],[Weigh]]*100)*Tableau1726[[#This Row],[Score]])","v":0},{"$f":"((Tableau1726[[#This Row],[Weigh]]*100)*F99)","v":48},{"$f":"IF(Tableau1726[[#This Row],[Score]]<>\"NA\",Tableau1726[[#This Row],[Colonne1]]-Tableau1726[[#This Row],[Priority (score + weigh)]],\"NA\")","v":48}]
[null,"8.A. Adequate skill level in epidemiology of members of the central unit",0.23100000000000001,{"$f":"'Scoring criteria'!E112","v":1},"Section 8 question 2 and 4",3,{"$f":"((Tableau1726[[#This Row],[Weigh]]*100)*Tableau1726[[#This Row],[Score]])","v":23.1},{"$f":"((Tableau1726[[#This Row],[Weigh]]*100)*F100)","v":69.300000000000011},{"$f":"IF(Tableau1726[[#This Row],[Score]]<>\"NA\",Tableau1726[[#This Row],[Colonne1]]-Tableau1726[[#This Row],[Priority (score + weigh)]],\"NA\")","v":46.20000000000001}]
[null,"4.B Adequacy of human, material, and financial resources for diagnostic needs",7.0999999999999994E-2,{"$f":"'Scoring criteria'!E50","v":0},"Section 4 question 8, 9, 10, 35, 36 and 37",3,{"$f":"((Tableau1726[[#This Row],[Weigh]]*100)*Tableau1726[[#This Row],[Score]])","v":0},{"$f":"((Tableau1726[[#This Row],[Weigh]]*100)*F101)","v":21.299999999999997},{"$f":"IF(Tableau1726[[#This Row],[Score]]<>\"NA\",Tableau1726[[#This Row],[Colonne1]]-Tableau1726[[#This Row],[Priority (score + weigh)]],\"NA\")","v":21.299999999999997}]
[null,"4.L Analysis deadlines at the laboratory (formalization, standardization, verification, transfer of results to the central unit)",7.0999999999999994E-2,{"$f":"'Scoring criteria'!E60","v":0},"Section 4 table at the end of the section column j and k and question 20 and 47",3,{"$f":"((Tableau1726[[#This Row],[Weigh]]*100)*Tableau1726[[#This Row],[Score]])","v":0},{"$f":"((Tableau1726[[#This Row],[Weigh]]*100)*F102)","v":21.299999999999997},{"$f":"IF(Tableau1726[[#This Row],[Score]]<>\"NA\",Tableau1726[[#This Row],[Colonne1]]-Tableau1726[[#This Row],[Priority (score + weigh)]],\"NA\")","v":21.299999999999997}]
[null,"2.C Existence of a scientific and technical committee for the system",0.16,{"$f":"'Scoring criteria'!E26","v":2},"Section 2 question 41, 45, 46, 48, 52 and 54",3,{"$f":"((Tableau1726[[#This Row],[Weigh]]*100)*Tableau1726[[#This Row],[Score]])","v":32},{"$f":"((Tableau1726[[#This Row],[Weigh]]*100)*F103)","v":48},{"$f":"IF(Tableau1726[[#This Row],[Score]]<>\"NA\",Tableau1726[[#This Row],[Colonne1]]-Tableau1726[[#This Row],[Priority (score + weigh)]],\"NA\")","v":16}]
[null,"7.C. Designated staff available and trained in data entry, management and analysis.",7.0999999999999994E-2,{"$f":"'Scoring criteria'!E102","v":1},"Section 7 question 52",3,{"$f":"((Tableau1726[[#This Row],[Weigh]]*100)*Tableau1726[[#This Row],[Score]])","v":7.1},{"$f":"((Tableau1726[[#This Row],[Weigh]]*100)*F104)","v":21.299999999999997},{"$f":"IF(Tableau1726[[#This Row],[Score]]<>\"NA\",Tableau1726[[#This Row],[Colonne1]]-Tableau1726[[#This Row],[Priority (score + weigh)]],\"NA\")","v":14.199999999999998}]
[null,"4.K Technical level of data management at the laboratory",7.0999999999999994E-2,{"$f":"'Scoring criteria'!E59","v":1.5},"Section 4 question 15, 18 and 45",3,{"$f":"((Tableau1726[[#This Row],[Weigh]]*100)*Tableau1726[[#This Row],[Score]])","v":10.649999999999999},{"$f":"((Tableau1726[[#This Row],[Weigh]]*100)*F105)","v":21.299999999999997},{"$f":"IF(Tableau1726[[#This Row],[Score]]<>\"NA\",Tableau1726[[#This Row],[Colonne1]]-Tableau1726[[#This Row],[Priority (score + weigh)]],\"NA\")","v":10.649999999999999}]
[null,"7.A. Adequacy of the data management system for the needs of the system (relational database, etc.)",7.0999999999999994E-2,{"$f":"'Scoring criteria'!E100","v":3},"Section 7 question 3, 8 and 9 ",3,{"$f":"((Tableau1726[[#This Row],[Weigh]]*100)*Tableau1726[[#This Row],[Score]])","v":21.299999999999997},{"$f":"((Tableau1726[[#This Row],[Weigh]]*100)*F106)","v":21.299999999999997},{"$f":"IF(Tableau1726[[#This Row],[Score]]<>\"NA\",Tableau1726[[#This Row],[Colonne1]]-Tableau1726[[#This Row],[Priority (score + weigh)]],\"NA\")","v":0}]
[null,"7.F Complete descriptive processing of data",7.0999999999999994E-2,{"$f":"'Scoring criteria'!E105","v":3},"Section 7 question 36, 37, 38, 40 and 49",3,{"$f":"((Tableau1726[[#This Row],[Weigh]]*100)*Tableau1726[[#This Row],[Score]])","v":21.299999999999997},{"$f":"((Tableau1726[[#This Row],[Weigh]]*100)*F107)","v":21.299999999999997},{"$f":"IF(Tableau1726[[#This Row],[Score]]<>\"NA\",Tableau1726[[#This Row],[Colonne1]]-Tableau1726[[#This Row],[Priority (score + weigh)]],\"NA\")","v":0}]
[]
[]
[null,"Diffusion and information"]
[null,"Criteria","Weigh","Score","Referencing question","Max","Priority (score + weigh)","Colonne1","Missing points"]
[null,"9.A Regular release of reports and scientific articles on surveillance results",0.375,{"$f":"'Scoring criteria'!E122","v":0},"Section 9 question 9, 10 and 11",3,{"$f":"((Tableau1827[[#This Row],[Weigh]]*100)*Tableau1827[[#This Row],[Score]])","v":0},{"$f":"((Tableau1827[[#This Row],[Weigh]]*100)*F112)","v":112.5},{"$f":"IF(Tableau1827[[#This Row],[Score]]<>\"NA\",Tableau1827[[#This Row],[Colonne1]]-Tableau1827[[#This Row],[Priority (score + weigh)]],\"NA\")","v":112.5}]
[null,"9.C. Regular dissemination of a relevant information bulletin",0.375,{"$f":"'Scoring criteria'!E124","v":1.5},"Section 9 question 33, 34, 35, 36 and 40",3,{"$f":"((Tableau1827[[#This Row],[Weigh]]*100)*Tableau1827[[#This Row],[Score]])","v":56.25},{"$f":"((Tableau1827[[#This Row],[Weigh]]*100)*F113)","v":112.5},{"$f":"IF(Tableau1827[[#This Row],[Score]]<>\"NA\",Tableau1827[[#This Row],[Colonne1]]-Tableau1827[[#This Row],[Priority (score + weigh)]],\"NA\")","v":56.25}]
[null,"9.D. Systematic return of reports on results to field actors (outside of a bulletin). ",0.125,{"$f":"'Scoring criteria'!E125","v":3},"Section 9 question 25 and 26",3,{"$f":"((Tableau1827[[#This Row],[Weigh]]*100)*Tableau1827[[#This Row],[Score]])","v":37.5},{"$f":"((Tableau1827[[#This Row],[Weigh]]*100)*F114)","v":37.5},{"$f":"IF(Tableau1827[[#This Row],[Score]]<>\"NA\",Tableau1827[[#This Row],[Colonne1]]-Tableau1827[[#This Row],[Priority (score + weigh)]],\"NA\")","v":0}]
[null,"9.F. Solid external communication policy",0.125,{"$f":"'Scoring criteria'!E127","v":3},"Section 9 question 24 and 32",3,{"$f":"((Tableau1827[[#This Row],[Weigh]]*100)*Tableau1827[[#This Row],[Score]])","v":37.5},{"$f":"((Tableau1827[[#This Row],[Weigh]]*100)*F115)","v":37.5},{"$f":"IF(Tableau1827[[#This Row],[Score]]<>\"NA\",Tableau1827[[#This Row],[Colonne1]]-Tableau1827[[#This Row],[Priority (score + weigh)]],\"NA\")","v":0}]

{"sheet":"Output 3","index":6,"n_rows":2,"n_cols":1,"rows_kept":2,"cut":false,"hidden":false,"merged":[[0,0,0,10],[1,0,1,10]]}
["SNATtrop"]
["Output 3"]

{"sheet":"Feedback_output_3","index":7,"n_rows":203,"n_cols":10,"rows_kept":203,"cut":false,"hidden":false,"merged":[[188,2,188,4],[0,2,0,4],[3,2,3,4],[27,2,27,4],[36,2,36,4],[46,2,46,4],[60,2,60,4],[74,2,74,4],[126,2,126,4],[154,2,154,4],[177,2,177,4],[1,2,1,4]]}
[null,null,"Feedback for output 3"]
[null,null,"To get started click to classify the criteria. For each quality criteria , the criteria used are classified according to their weighs and their score.  In each table the first criteria are the most important for the notation and they need the better score."]
[]
[null,null,"Sensitivity"]
[null,null,"Criteria","Weigh","Score","Referencing question","Max","Priority (score + weigh)","Maximum","Missing points"]
[null,null,"6.F Vector surveillance and control",1,{"$f":"'Scoring criteria'!E91","v":"NA"},"Section 5 (part 1) question 46 and section 5 (part 3) question 37 and 38",3,{"$f":"Tableau1223[[#This Row],[Weigh]]*Tableau1223[[#This Row],[Score]]","v":{"$error":"#VALUE!"}},{"$f":"Tableau1223[[#This Row],[Weigh]]*G6","v":3},{"$f":"IF(Tableau1223[[#This Row],[Score]]<>\"NA\",Tableau1223[[#This Row],[Maximum]]-Tableau1223[[#This Row],[Priority (score + weigh)]],\"NA\")","v":"NA"}]
[null,null,"6.I Level of satisfaction of active (planned) surveillance completeness rate",3,{"$f":"'Scoring criteria'!E94","v":"NA"},"Section 5 (part 3) question 33 and 34",3,{"$f":"Tableau1223[[#This Row],[Weigh]]*Tableau1223[[#This Row],[Score]]","v":{"$error":"#VALUE!"}},{"$f":"Tableau1223[[#This Row],[Weigh]]*G7","v":9},{"$f":"IF(Tableau1223[[#This Row],[Score]]<>\"NA\",Tableau1223[[#This Row],[Maximum]]-Tableau1223[[#This Row],[Priority (score + weigh)]],\"NA\")","v":"NA"}]
[null,null,"8.D. Regular advanced training",3,{"$f":"'Scoring criteria'!E115","v":0},"Section 8 question 14 and 20",3,{"$f":"Tableau1223[[#This Row],[Weigh]]*Tableau1223[[#This Row],[Score]]","v":0},{"$f":"Tableau1223[[#This Row],[Weigh]]*G8","v":9},{"$f":"IF(Tableau1223[[#This Row],[Score]]<>\"NA\",Tableau1223[[#This Row],[Maximum]]-Tableau1223[[#This Row],[Priority (score + weigh)]],\"NA\")","v":9}]
[null,null,"6.E Surveillance of susceptible wild animals",2,{"$f":"'Scoring criteria'!E90","v":0},"Section 5 (part 1) qestion 44 and section (part 3) question 35 and 36",3,{"$f":"Tableau1223[[#This Row],[Weigh]]*Tableau1223[[#This Row],[Score]]","v":0},{"$f":"Tableau1223[[#This Row],[Weigh]]*G9","v":6},{"$f":"IF(Tableau1223[[#This Row],[Score]]<>\"NA\",Tableau1223[[#This Row],[Maximum]]-Tableau1223[[#This Row],[Priority (score + weigh)]],\"NA\")","v":6}]
[null,null,"6.D Relevance and suitability of active (planned) surveillance protocols ",3,{"$f":"'Scoring criteria'!E89","v":1},"Section 5 (part 1) question 40, 42 and 41",3,{"$f":"Tableau1223[[#This Row],[Weigh]]*Tableau1223[[#This Row],[Score]]","v":3},{"$f":"Tableau1223[[#This Row],[Weigh]]*G10","v":9},{"$f":"IF(Tableau1223[[#This Row],[Score]]<>\"NA\",Tableau1223[[#This Row],[Maximum]]-Tableau1223[[#This Row],[Priority (score + weigh)]],\"NA\")","v":6}]
[null,null,"9.C. Regular dissemination of a relevant information bulletin",3,{"$f":"'Scoring criteria'!E124","v":1.5},"Section 9 question 33, 34, 35, 36 and 40",3,{"$f":"Tableau1223[[#This Row],[Weigh]]*Tableau1223[[#This Row],[Score]]","v":4.5},{"$f":"Tableau1223[[#This Row],[Weigh]]*G11","v":9},{"$f":"IF(Tableau1223[[#This Row],[Score]]<>\"NA\",Tableau1223[[#This Row],[Maximum]]-Tableau1223[[#This Row],[Priority (score + weigh)]],\"NA\")","v":4.5}]
[null,null,"4.H Sensitivity of diagnostic techniques",3,{"$f":"'Scoring criteria'!E56","v":1.5},"Section 4 table at the end of the section column b",3,{"$f":"Tableau1223[[#This Row],[Weigh]]*Tableau1223[[#This Row],[Score]]","v":4.5},{"$f":"Tableau1223[[#This Row],[Weigh]]*G12","v":9},{"$f":"IF(Tableau1223[[#This Row],[Score]]<>\"NA\",Tableau1223[[#This Row],[Maximum]]-Tableau1223[[#This Row],[Priority (score + weigh)]],\"NA\")","v":4.5}]
[null,null,"5.N Acceptability of the consequences of a suspicion or case for the source or collector of data",3,{"$f":"'Scoring criteria'!E80","v":1.5},"section 5 (part 3) question 21 and 22",3,{"$f":"Tableau1223[[#This Row],[Weigh]]*Tableau1223[[#This Row],[Score]]","v":4.5},{"$f":"Tableau1223[[#This Row],[Weigh]]*G13","v":9},{"$f":"IF(Tableau1223[[#This Row],[Score]]<>\"NA\",Tableau1223[[#This Row],[Maximum]]-Tableau1223[[#This Row],[Priority (score + weigh)]],\"NA\")","v":4.5}]
[null,null,"6.C Existence of awareness building programs for data sources in a passive (event-based) network ",3,{"$f":"'Scoring criteria'!E88","v":2},"Section 5 (part 1) question 61 and section 5 (part 3) question 23, 24 and 37",3,{"$f":"Tableau1223[[#This Row],[Weigh]]*Tableau1223[[#This Row],[Score]]","v":6},{"$f":"Tableau1223[[#This Row],[Weigh]]*G14","v":9},{"$f":"IF(Tableau1223[[#This Row],[Score]]<>\"NA\",Tableau1223[[#This Row],[Maximum]]-Tableau1223[[#This Row],[Priority (score + weigh)]],\"NA\")","v":3}]
[null,null,"3.G Exhaustiveness or representativeness of the field agents’ coverage of the target population",3,{"$f":"'Scoring criteria'!E42","v":2},"Section 3 (part 2) question 10, 14 and 16",3,{"$f":"Tableau1223[[#This Row],[Weigh]]*Tableau1223[[#This Row],[Score]]","v":6},{"$f":"Tableau1223[[#This Row],[Weigh]]*G15","v":9},{"$f":"IF(Tableau1223[[#This Row],[Score]]<>\"NA\",Tableau1223[[#This Row],[Maximum]]-Tableau1223[[#This Row],[Priority (score + weigh)]],\"NA\")","v":3}]
[null,null,"2.E Frequency of meetings of the central coordinating body",2,{"$f":"'Scoring criteria'!E28","v":2},"Section 2 question 61, 62, 65 and 67",3,{"$f":"Tableau1223[[#This Row],[Weigh]]*Tableau1223[[#This Row],[Score]]","v":4},{"$f":"Tableau1223[[#This Row],[Weigh]]*G16","v":6},{"$f":"IF(Tableau1223[[#This Row],[Score]]<>\"NA\",Tableau1223[[#This Row],[Maximum]]-Tableau1223[[#This Row],[Priority (score + weigh)]],\"NA\")","v":2}]
[null,null,"5.H Relevance of collected  samples",3,{"$f":"'Scoring criteria'!E74","v":2.5},"Section 5 (part 1) question 24, Section 5 (part 2) question 9 Section 5 (part 3) Quesstion 14 section 1 question 1 and 3",3,{"$f":"Tableau1223[[#This Row],[Weigh]]*Tableau1223[[#This Row],[Score]]","v":7.5},{"$f":"Tableau1223[[#This Row],[Weigh]]*G17","v":9},{"$f":"IF(Tableau1223[[#This Row],[Score]]<>\"NA\",Tableau1223[[#This Row],[Maximum]]-Tableau1223[[#This Row],[Priority (score + weigh)]],\"NA\")","v":1.5}]
[null,null,"6.B Existence of passive (event-based) surveillance whose results are exhaustive or representative",6,{"$f":"'Scoring criteria'!E87","v":3},"Section 5 (part 1) question 16 and 38",3,{"$f":"Tableau1223[[#This Row],[Weigh]]*Tableau1223[[#This Row],[Score]]","v":18},{"$f":"Tableau1223[[#This Row],[Weigh]]*G18","v":18},{"$f":"IF(Tableau1223[[#This Row],[Score]]<>\"NA\",Tableau1223[[#This Row],[Maximum]]-Tableau1223[[#This Row],[Priority (score + weigh)]],\"NA\")","v":0}]
[null,null,"9.B. Return of individual test results to field actors",3,{"$f":"'Scoring criteria'!E123","v":3},"Section 9 question 14",3,{"$f":"Tableau1223[[#This Row],[Weigh]]*Tableau1223[[#This Row],[Score]]","v":9},{"$f":"Tableau1223[[#This Row],[Weigh]]*G19","v":9},{"$f":"IF(Tableau1223[[#This Row],[Score]]<>\"NA\",Tableau1223[[#This Row],[Maximum]]-Tableau1223[[#This Row],[Priority (score + weigh)]],\"NA\")","v":0}]
[null,null,"9.D. Systematic return of reports on results to field actors (outside of a bulletin). ",3,{"$f":"'Scoring criteria'!E125","v":3},"Section 9 question 25 and 26",3,{"$f":"Tableau1223[[#This Row],[Weigh]]*Tableau1223[[#This Row],[Score]]","v":9},{"$f":"Tableau1223[[#This Row],[Weigh]]*G20","v":9},{"$f":"IF(Tableau1223[[#This Row],[Score]]<>\"NA\",Tableau1223[[#This Row],[Maximum]]-Tableau1223[[#This Row],[Priority (score + weigh)]],\"NA\")","v":0}]
[null,null,"5.D Sensitivity of the case or threat definition",3,{"$f":"'Scoring criteria'!E70","v":3},"Section 5 question 16",3,{"$f":"Tableau1223[[#This Row],[Weigh]]*Tableau1223[[#This Row],[Score]]","v":9},{"$f":"Tableau1223[[#This Row],[Weigh]]*G21","v":9},{"$f":"IF(Tableau1223[[#This Row],[Score]]<>\"NA\",Tableau1223[[#This Row],[Maximum]]-Tableau1223[[#This Row],[Priority (score + weigh)]],\"NA\")","v":0}]
[null,null,"5.J Quality of samples collected",3,{"$f":"'Scoring criteria'!E76","v":3},"Section 5 (part 1) question 28",3,{"$f":"Tableau1223[[#This Row],[Weigh]]*Tableau1223[[#This Row],[Score]]","v":9},{"$f":"Tableau1223[[#This Row],[Weigh]]*G22","v":9},{"$f":"IF(Tableau1223[[#This Row],[Score]]<>\"NA\",Tableau1223[[#This Row],[Maximum]]-Tableau1223[[#This Row],[Priority (score + weigh)]],\"NA\")","v":0}]
[null,null,"9.E. Presence of a communications system organized transversally and vertically between field actors (mail, web, telephone…)",1,{"$f":"'Scoring criteria'!E126","v":3},"Section 9 question 13 and 16 ",3,{"$f":"Tableau1223[[#This Row],[Weigh]]*Tableau1223[[#This Row],[Score]]","v":3},{"$f":"Tableau1223[[#This Row],[Weigh]]*G23","v":3},{"$f":"IF(Tableau1223[[#This Row],[Score]]<>\"NA\",Tableau1223[[#This Row],[Maximum]]-Tableau1223[[#This Row],[Priority (score + weigh)]],\"NA\")","v":0}]
[null,null,"3.B Active role of intermediary units in the functioning of the system (validation, management, feedback)",1,{"$f":"'Scoring criteria'!E37","v":3},"Section 3 (part 2) question 1",3,{"$f":"Tableau1223[[#This Row],[Weigh]]*Tableau1223[[#This Row],[Score]]","v":3},{"$f":"Tableau1223[[#This Row],[Weigh]]*G24","v":3},{"$f":"IF(Tableau1223[[#This Row],[Score]]<>\"NA\",Tableau1223[[#This Row],[Maximum]]-Tableau1223[[#This Row],[Priority (score + weigh)]],\"NA\")","v":0}]
[null,null,"4.G Relevance of diagnostic techniques",3,{"$f":"'Scoring criteria'!E55","v":3},"Section 4 question 54, 55 and 56",3,{"$f":"Tableau1223[[#This Row],[Weigh]]*Tableau1223[[#This Row],[Score]]","v":9},{"$f":"Tableau1223[[#This Row],[Weigh]]*G25","v":9},{"$f":"IF(Tableau1223[[#This Row],[Score]]<>\"NA\",Tableau1223[[#This Row],[Maximum]]-Tableau1223[[#This Row],[Priority (score + weigh)]],\"NA\")","v":0}]
[]
[]
[null,null,"Specificity"]
[null,null,"Criteria","Weigh","Score","Referencing question ","Max","Priority (score + weigh)","Maximum","Missing points"]
[null,null,"8.D. Regular advanced training",2,{"$f":"'Scoring criteria'!E115","v":0},"Section 8 question 14 and 20",3,{"$f":"Tableau28[[#This Row],[Weigh]]*Tableau28[[#This Row],[Score]]","v":0},{"$f":"Tableau28[[#This Row],[Weigh]]*G30","v":6},{"$f":"IF(Tableau28[[#This Row],[Score]]<>\"NA\",Tableau28[[#This Row],[Maximum]]-Tableau28[[#This Row],[Priority (score + weigh)]],\"NA\")","v":6}]
[null,null,"4.I Specificity of diagnostic techniques",3,{"$f":"'Scoring criteria'!E57","v":1.5},"Section 4 table at the end of the section column c",3,{"$f":"Tableau28[[#This Row],[Weigh]]*Tableau28[[#This Row],[Score]]","v":4.5},{"$f":"Tableau28[[#This Row],[Weigh]]*G31","v":9},{"$f":"IF(Tableau28[[#This Row],[Score]]<>\"NA\",Tableau28[[#This Row],[Maximum]]-Tableau28[[#This Row],[Priority (score + weigh)]],\"NA\")","v":4.5}]
[null,null,"5.E Specificity of the case or threat definition",3,{"$f":"'Scoring criteria'!E71","v":1.5},"Section 5 question 17",3,{"$f":"Tableau28[[#This Row],[Weigh]]*Tableau28[[#This Row],[Score]]","v":4.5},{"$f":"Tableau28[[#This Row],[Weigh]]*G32","v":9},{"$f":"IF(Tableau28[[#This Row],[Score]]<>\"NA\",Tableau28[[#This Row],[Maximum]]-Tableau28[[#This Row],[Priority (score + weigh)]],\"NA\")","v":4.5}]
[null,null,"8.B. Initial training implemented for all field agents when joining the system",2,{"$f":"'Scoring criteria'!E113","v":1},"Section 8 question 9 and 10",3,{"$f":"Tableau28[[#This Row],[Weigh]]*Tableau28[[#This Row],[Score]]","v":2},{"$f":"Tableau28[[#This Row],[Weigh]]*G33","v":6},{"$f":"IF(Tableau28[[#This Row],[Score]]<>\"NA\",Tableau28[[#This Row],[Maximum]]-Tableau28[[#This Row],[Priority (score + weigh)]],\"NA\")","v":4}]
[null,null,"6.C Existence of awareness building programs for data sources in a passive (event-based) network ",2,{"$f":"'Scoring criteria'!E88","v":2},"Section 5 (part 1) question 61 and section 5 (part 3) question 23, 24 and 37",3,{"$f":"Tableau28[[#This Row],[Weigh]]*Tableau28[[#This Row],[Score]]","v":4},{"$f":"Tableau28[[#This Row],[Weigh]]*G34","v":6},{"$f":"IF(Tableau28[[#This Row],[Score]]<>\"NA\",Tableau28[[#This Row],[Maximum]]-Tableau28[[#This Row],[Priority (score + weigh)]],\"NA\")","v":2}]
[]
[]
[null,null,"Representativity"]
[null,null,"Criteria","Weigh","Score","Referencing question","Max","Priority (score + weigh)","Maximum","Missing points"]
[null,null,"6.G Representativeness of the populations targeted by sampling in active (planned) surveillance",3,{"$f":"'Scoring criteria'!E92","v":"NA"},"Section 5 (part 1) question 33 and section 5 (part 3) question 29",3,{"$f":"Tableau29[[#This Row],[Weigh]]*Tableau29[[#This Row],[Score]]","v":{"$error":"#VALUE!"}},{"$f":"Tableau29[[#This Row],[Weigh]]*G39","v":9},{"$f":"IF(Tableau29[[#This Row],[Score]]<>\"NA\",Tableau29[[#This Row],[Maximum]]-Tableau29[[#This Row],[Priority (score + weigh)]],\"NA\")","v":"NA"}]
[null,null,"6.I Level of satisfaction of active (planned) surveillance completeness rate",3,{"$f":"'Scoring criteria'!E94","v":"NA"},"Section 5 (part 3) question 33 and 34",3,{"$f":"Tableau29[[#This Row],[Weigh]]*Tableau29[[#This Row],[Score]]","v":{"$error":"#VALUE!"}},{"$f":"Tableau29[[#This Row],[Weigh]]*G40","v":9},{"$f":"IF(Tableau29[[#This Row],[Score]]<>\"NA\",Tableau29[[#This Row],[Maximum]]-Tableau29[[#This Row],[Priority (score + weigh)]],\"NA\")","v":"NA"}]
[null,null,"6.D Relevance and suitability of active (planned) surveillance protocols ",3,{"$f":"'Scoring criteria'!E89","v":1},"Section 5 (part 1) question 40, 42 and 41",3,{"$f":"Tableau29[[#This Row],[Weigh]]*Tableau29[[#This Row],[Score]]","v":3},{"$f":"Tableau29[[#This Row],[Weigh]]*G41","v":9},{"$f":"IF(Tableau29[[#This Row],[Score]]<>\"NA\",Tableau29[[#This Row],[Maximum]]-Tableau29[[#This Row],[Priority (score + weigh)]],\"NA\")","v":6}]
[null,null,"3.G Exhaustiveness or representativeness of the field agents’ coverage of the target population",3,{"$f":"'Scoring criteria'!E42","v":2},"Section 3 (part 2) question 10, 14 and 16",3,{"$f":"Tableau29[[#This Row],[Weigh]]*Tableau29[[#This Row],[Score]]","v":6},{"$f":"Tableau29[[#This Row],[Weigh]]*G42","v":9},{"$f":"IF(Tableau29[[#This Row],[Score]]<>\"NA\",Tableau29[[#This Row],[Maximum]]-Tableau29[[#This Row],[Priority (score + weigh)]],\"NA\")","v":3}]
[null,null,"6.B Existence of passive (event-based) surveillance whose results are exhaustive or representative",3,{"$f":"'Scoring criteria'!E87","v":3},"Section 5 (part 1) question 16 and 38",3,{"$f":"Tableau29[[#This Row],[Weigh]]*Tableau29[[#This Row],[Score]]","v":9},{"$f":"Tableau29[[#This Row],[Weigh]]*G43","v":9},{"$f":"IF(Tableau29[[#This Row],[Score]]<>\"NA\",Tableau29[[#This Row],[Maximum]]-Tableau29[[#This Row],[Priority (score + weigh)]],\"NA\")","v":0}]
[null,null,"3.A Existence of formal intermediary units covering the entire territory",1,{"$f":"'Scoring criteria'!E36","v":3},"Section 3 question 1, 6 and 12",3,{"$f":"Tableau29[[#This Row],[Weigh]]*Tableau29[[#This Row],[Score]]","v":3},{"$f":"Tableau29[[#This Row],[Weigh]]*G44","v":3},{"$f":"IF(Tableau29[[#This Row],[Score]]<>\"NA\",Tableau29[[#This Row],[Maximum]]-Tableau29[[#This Row],[Priority (score + weigh)]],\"NA\")","v":0}]
[]
[]
[null,null,"Rapidity"]
[null,null,"Criteria","Weigh","Score","Referencing question","Max","Priority (score + weigh)","Maximum","Missing points"]
[null,null,"4.L Analysis deadlines at the laboratory (formalization, standardization, verification, transfer of results to the central unit)",6,{"$f":"'Scoring criteria'!E60","v":0},"Section 4 table at the end of the section column j and k and question 20 and 47",3,{"$f":"Tableau30[[#This Row],[Score]]","v":0},{"$f":"Tableau30[[#This Row],[Weigh]]*G49","v":18},{"$f":"IF(Tableau30[[#This Row],[Score]]<>\"NA\",Tableau30[[#This Row],[Maximum]]-Tableau30[[#This Row],[Priority (score + weigh)]],\"NA\")","v":18}]
[null,null,"3.E Adequacy of material and financial resources of intermediary units ",3,{"$f":"'Scoring criteria'!E40","v":0},"Section 3 (part 2) question 2, 3 and 4",3,{"$f":"Tableau30[[#This Row],[Score]]","v":0},{"$f":"Tableau30[[#This Row],[Weigh]]*G50","v":9},{"$f":"IF(Tableau30[[#This Row],[Score]]<>\"NA\",Tableau30[[#This Row],[Maximum]]-Tableau30[[#This Row],[Priority (score + weigh)]],\"NA\")","v":9}]
[null,null,"3.H Adequacy of material and financial resources at the field level ",3,{"$f":"'Scoring criteria'!E43","v":0},"Section 3 (part 3) question  4, 5 and 6",3,{"$f":"Tableau30[[#This Row],[Score]]","v":0},{"$f":"Tableau30[[#This Row],[Weigh]]*G51","v":9},{"$f":"IF(Tableau30[[#This Row],[Score]]<>\"NA\",Tableau30[[#This Row],[Maximum]]-Tableau30[[#This Row],[Priority (score + weigh)]],\"NA\")","v":9}]
[null,null,"4.K Technical level of data management at the laboratory",3,{"$f":"'Scoring criteria'!E59","v":1.5},"Section 4 question 15, 18 and 45",3,{"$f":"Tableau30[[#This Row],[Score]]","v":1.5},{"$f":"Tableau30[[#This Row],[Weigh]]*G52","v":9},{"$f":"IF(Tableau30[[#This Row],[Score]]<>\"NA\",Tableau30[[#This Row],[Maximum]]-Tableau30[[#This Row],[Priority (score + weigh)]],\"NA\")","v":7.5}]
[null,null,"7.B Data input interval in accordance with the objectives and use of system results",2,{"$f":"'Scoring criteria'!E101","v":0},"Section 7 question 18",3,{"$f":"Tableau30[[#This Row],[Score]]","v":0},{"$f":"Tableau30[[#This Row],[Weigh]]*G53","v":6},{"$f":"IF(Tableau30[[#This Row],[Score]]<>\"NA\",Tableau30[[#This Row],[Maximum]]-Tableau30[[#This Row],[Priority (score + weigh)]],\"NA\")","v":6}]
[null,null,"7.C. Designated staff available and trained in data entry, management and analysis.",2,{"$f":"'Scoring criteria'!E102","v":1},"Section 7 question 52",3,{"$f":"Tableau30[[#This Row],[Score]]","v":1},{"$f":"Tableau30[[#This Row],[Weigh]]*G54","v":6},{"$f":"IF(Tableau30[[#This Row],[Score]]<>\"NA\",Tableau30[[#This Row],[Maximum]]-Tableau30[[#This Row],[Priority (score + weigh)]],\"NA\")","v":5}]
[null,null,"7.A. Adequacy of the data management system for the needs of the system (relational database, etc.)",2,{"$f":"'Scoring criteria'!E100","v":3},"Section 7 question 3, 8 and 9 ",3,{"$f":"Tableau30[[#This Row],[Score]]","v":3},{"$f":"Tableau30[[#This Row],[Weigh]]*G55","v":6},{"$f":"IF(Tableau30[[#This Row],[Score]]<>\"NA\",Tableau30[[#This Row],[Maximum]]-Tableau30[[#This Row],[Priority (score + weigh)]],\"NA\")","v":3}]
[null,null,"9.E. Presence of a communications system organized transversally and vertically between field actors (mail, web, telephone…)",2,{"$f":"'Scoring criteria'!E126","v":3},"Section 9 question 13 and 16 ",3,{"$f":"Tableau30[[#This Row],[Score]]","v":3},{"$f":"Tableau30[[#This Row],[Weigh]]*G56","v":6},{"$f":"IF(Tableau30[[#This Row],[Score]]<>\"NA\",Tableau30[[#This Row],[Maximum]]-Tableau30[[#This Row],[Priority (score + weigh)]],\"NA\")","v":3}]
[null,null,"4.B Adequacy of human, material, and financial resources for diagnostic needs",1,{"$f":"'Scoring criteria'!E50","v":0},"Section 4 question 8, 9, 10, 35, 36 and 37",3,{"$f":"Tableau30[[#This Row],[Score]]","v":0},{"$f":"Tableau30[[#This Row],[Weigh]]*G57","v":3},{"$f":"IF(Tableau30[[#This Row],[Score]]<>\"NA\",Tableau30[[#This Row],[Maximum]]-Tableau30[[#This Row],[Priority (score + weigh)]],\"NA\")","v":3}]
[null,null,"4.F Existence of an investigation team to support field agents",1,{"$f":"'Scoring criteria'!E54","v":2},"Section 4 question 52 and 53",3,{"$f":"Tableau30[[#This Row],[Score]]","v":2},{"$f":"Tableau30[[#This Row],[Weigh]]*G58","v":3},{"$f":"IF(Tableau30[[#This Row],[Score]]<>\"NA\",Tableau30[[#This Row],[Maximum]]-Tableau30[[#This Row],[Priority (score + weigh)]],\"NA\")","v":1}]
[]
[]
[null,null,"Flexibility"]
[null,null,"Criteria","Weigh","Score","Referencing question","Max","Priority (score + weigh)","Maximum","Missing points"]
[null,null,"10.B. Performance indicators regularly measured, interpreted, and disseminated",3,{"$f":"'Scoring criteria'!E135","v":0},"Section 10 question 6, 7, 9 and 10",3,{"$f":"Tableau3032[[#This Row],[Weigh]]*Tableau3032[[#This Row],[Score]]","v":0},{"$f":"Tableau3032[[#This Row],[Weigh]]*G63","v":9},{"$f":"IF(Tableau3032[[#This Row],[Score]]<>\"NA\",Tableau3032[[#This Row],[Maximum]]-Tableau3032[[#This Row],[Priority (score + weigh)]],\"NA\")","v":9}]
[null,null,"8.D. Regular advanced training",3,{"$f":"'Scoring criteria'!E115","v":0},"Section 8 question 14 and 20",3,{"$f":"Tableau3032[[#This Row],[Weigh]]*Tableau3032[[#This Row],[Score]]","v":0},{"$f":"Tableau3032[[#This Row],[Weigh]]*G64","v":9},{"$f":"IF(Tableau3032[[#This Row],[Score]]<>\"NA\",Tableau3032[[#This Row],[Maximum]]-Tableau3032[[#This Row],[Priority (score + weigh)]],\"NA\")","v":9}]
[null,null,"2.A Existence of an operational management structure (central unit)",3,{"$f":"'Scoring criteria'!E24","v":0.5},"Section 2 question 7, 9, 10, 20 and 22",3,{"$f":"Tableau3032[[#This Row],[Weigh]]*Tableau3032[[#This Row],[Score]]","v":1.5},{"$f":"Tableau3032[[#This Row],[Weigh]]*G65","v":9},{"$f":"IF(Tableau3032[[#This Row],[Score]]<>\"NA\",Tableau3032[[#This Row],[Maximum]]-Tableau3032[[#This Row],[Priority (score + weigh)]],\"NA\")","v":7.5}]
[null,null,"2.B Existence of an operational steering structure that is representative of the partners (steering committee)",3,{"$f":"'Scoring criteria'!E25","v":1},"Section 2 question 28/29, 31, 34, 37, 38 and 39",3,{"$f":"Tableau3032[[#This Row],[Weigh]]*Tableau3032[[#This Row],[Score]]","v":3},{"$f":"Tableau3032[[#This Row],[Weigh]]*G66","v":9},{"$f":"IF(Tableau3032[[#This Row],[Score]]<>\"NA\",Tableau3032[[#This Row],[Maximum]]-Tableau3032[[#This Row],[Priority (score + weigh)]],\"NA\")","v":6}]
[null,null,"10.D. Implementation of corrective measures",3,{"$f":"'Scoring criteria'!E137","v":1},"Section 10 question 12, 15 and 16",3,{"$f":"Tableau3032[[#This Row],[Weigh]]*Tableau3032[[#This Row],[Score]]","v":3},{"$f":"Tableau3032[[#This Row],[Weigh]]*G67","v":9},{"$f":"IF(Tableau3032[[#This Row],[Score]]<>\"NA\",Tableau3032[[#This Row],[Maximum]]-Tableau3032[[#This Row],[Priority (score + weigh)]],\"NA\")","v":6}]
[null,null,"3.F Existence of coordination meetings at the intermediate level",3,{"$f":"'Scoring criteria'!E41","v":2},"Section 3 (part 1) question 18, 21, 28, 30 and 32",3,{"$f":"Tableau3032[[#This Row],[Weigh]]*Tableau3032[[#This Row],[Score]]","v":6},{"$f":"Tableau3032[[#This Row],[Weigh]]*G68","v":9},{"$f":"IF(Tableau3032[[#This Row],[Score]]<>\"NA\",Tableau3032[[#This Row],[Maximum]]-Tableau3032[[#This Row],[Priority (score + weigh)]],\"NA\")","v":3}]
[null,null,"2.C Existence of a scientific and technical committee for the system",3,{"$f":"'Scoring criteria'!E26","v":2},"Section 2 question 41, 45, 46, 48, 52 and 54",3,{"$f":"Tableau3032[[#This Row],[Weigh]]*Tableau3032[[#This Row],[Score]]","v":6},{"$f":"Tableau3032[[#This Row],[Weigh]]*G69","v":9},{"$f":"IF(Tableau3032[[#This Row],[Score]]<>\"NA\",Tableau3032[[#This Row],[Maximum]]-Tableau3032[[#This Row],[Priority (score + weigh)]],\"NA\")","v":3}]
[null,null,"2.E Frequency of meetings of the central coordinating body",3,{"$f":"'Scoring criteria'!E28","v":2},"Section 2 question 61, 62, 65 and 67",3,{"$f":"Tableau3032[[#This Row],[Weigh]]*Tableau3032[[#This Row],[Score]]","v":6},{"$f":"Tableau3032[[#This Row],[Weigh]]*G70","v":9},{"$f":"IF(Tableau3032[[#This Row],[Score]]<>\"NA\",Tableau3032[[#This Row],[Maximum]]-Tableau3032[[#This Row],[Priority (score + weigh)]],\"NA\")","v":3}]
[null,null,"4.F Existence of an investigation team to support field agents",2,{"$f":"'Scoring criteria'!E54","v":2},"Section 4 question 52 and 53",3,{"$f":"Tableau3032[[#This Row],[Weigh]]*Tableau3032[[#This Row],[Score]]","v":4},{"$f":"Tableau3032[[#This Row],[Weigh]]*G71","v":6},{"$f":"IF(Tableau3032[[#This Row],[Score]]<>\"NA\",Tableau3032[[#This Row],[Maximum]]-Tableau3032[[#This Row],[Priority (score + weigh)]],\"NA\")","v":2}]
[null,null,"3.A Existence of formal intermediary units covering the entire territory",3,{"$f":"'Scoring criteria'!E36","v":3},"Section 3 (part 1) question 1, 8 and 5",3,{"$f":"Tableau3032[[#This Row],[Weigh]]*Tableau3032[[#This Row],[Score]]","v":9},{"$f":"Tableau3032[[#This Row],[Weigh]]*G72","v":9},{"$f":"IF(Tableau3032[[#This Row],[Score]]<>\"NA\",Tableau3032[[#This Row],[Maximum]]-Tableau3032[[#This Row],[Priority (score + weigh)]],\"NA\")","v":0}]
[]
[]
[null,null,"Fiability"]
[null,null,"Criteria","Weigh","Score","Referencing question","Max","Priority (score + weigh)","Maximum","Missing points"]
[null,null,"6.G Representativeness of the populations targeted by sampling in active (planned) surveillance",3,{"$f":"'Scoring criteria'!E92","v":"NA"},"Section 5 (part 1) question 33 and section 5 (part 3) question 29",3,{"$f":"Tableau122333[[#This Row],[Weigh]]*Tableau122333[[#This Row],[Score]]","v":{"$error":"#VALUE!"}},{"$f":"Tableau122333[[#This Row],[Weigh]]*G77","v":9},{"$f":"IF(Tableau122333[[#This Row],[Score]]<>\"NA\",Tableau122333[[#This Row],[Maximum]]-Tableau122333[[#This Row],[Priority (score + weigh)]],\"NA\")","v":"NA"}]
[null,null,"6.H Precision of sample under active (planned) surveillance",2,{"$f":"'Scoring criteria'!E93","v":"NA"},"Section 3 (part 1) question 31, section 3 (part 3) question 2  section 4 table at the end of the section column b and c",3,{"$f":"Tableau122333[[#This Row],[Weigh]]*Tableau122333[[#This Row],[Score]]","v":{"$error":"#VALUE!"}},{"$f":"Tableau122333[[#This Row],[Weigh]]*G78","v":6},{"$f":"IF(Tableau122333[[#This Row],[Score]]<>\"NA\",Tableau122333[[#This Row],[Maximum]]-Tableau122333[[#This Row],[Priority (score + weigh)]],\"NA\")","v":"NA"}]
[null,null,"6.I Level of satisfaction of active (planned) surveillance completeness rate",3,{"$f":"'Scoring criteria'!E94","v":"NA"},"Section 5 (part 3) question 33 and 34",3,{"$f":"Tableau122333[[#This Row],[Weigh]]*Tableau122333[[#This Row],[Score]]","v":{"$error":"#VALUE!"}},{"$f":"Tableau122333[[#This Row],[Weigh]]*G79","v":9},{"$f":"IF(Tableau122333[[#This Row],[Score]]<>\"NA\",Tableau122333[[#This Row],[Maximum]]-Tableau122333[[#This Row],[Priority (score + weigh)]],\"NA\")","v":"NA"}]
[null,null,"10.B. Performance indicators regularly measured, interpreted, and disseminated",3,{"$f":"'Scoring criteria'!E135","v":0},"Section 10 question 6, 7, 9 and 10",3,{"$f":"Tableau122333[[#This Row],[Weigh]]*Tableau122333[[#This Row],[Score]]","v":0},{"$f":"Tableau122333[[#This Row],[Weigh]]*G80","v":9},{"$f":"IF(Tableau122333[[#This Row],[Score]]<>\"NA\",Tableau122333[[#This Row],[Maximum]]-Tableau122333[[#This Row],[Priority (score + weigh)]],\"NA\")","v":9}]
[null,null,"3.D Harmonization of intermediary units’ activities",3,{"$f":"'Scoring criteria'!E39","v":0},"section 3 (part 1) question 12, 13 and 14",3,{"$f":"Tableau122333[[#This Row],[Weigh]]*Tableau122333[[#This Row],[Score]]","v":0},{"$f":"Tableau122333[[#This Row],[Weigh]]*G81","v":9},{"$f":"IF(Tableau122333[[#This Row],[Score]]<>\"NA\",Tableau122333[[#This Row],[Maximum]]-Tableau122333[[#This Row],[Priority (score + weigh)]],\"NA\")","v":9}]
[null,null,"3.E Adequacy of material and financial resources of intermediary units ",3,{"$f":"'Scoring criteria'!E40","v":0},"Section 3 (part 2) question 2, 3 and 4",3,{"$f":"Tableau122333[[#This Row],[Weigh]]*Tableau122333[[#This Row],[Score]]","v":0},{"$f":"Tableau122333[[#This Row],[Weigh]]*G82","v":9},{"$f":"IF(Tableau122333[[#This Row],[Score]]<>\"NA\",Tableau122333[[#This Row],[Maximum]]-Tableau122333[[#This Row],[Priority (score + weigh)]],\"NA\")","v":9}]
[null,null,"4.B Adequacy of human, material, and financial resources for diagnostic needs",3,{"$f":"'Scoring criteria'!E50","v":0},"Section 4 question 8, 9, 10, 35, 36 and 37",3,{"$f":"Tableau122333[[#This Row],[Weigh]]*Tableau122333[[#This Row],[Score]]","v":0},{"$f":"Tableau122333[[#This Row],[Weigh]]*G83","v":9},{"$f":"IF(Tableau122333[[#This Row],[Score]]<>\"NA\",Tableau122333[[#This Row],[Maximum]]-Tableau122333[[#This Row],[Priority (score + weigh)]],\"NA\")","v":9}]
[null,null,"6.A Appropriateness of surveillance procedures with the system's objectives",3,{"$f":"'Scoring criteria'!E86","v":0},"Section 5 (part 1) question 50, 48 and 49",3,{"$f":"Tableau122333[[#This Row],[Weigh]]*Tableau122333[[#This Row],[Score]]","v":0},{"$f":"Tableau122333[[#This Row],[Weigh]]*G84","v":9},{"$f":"IF(Tableau122333[[#This Row],[Score]]<>\"NA\",Tableau122333[[#This Row],[Maximum]]-Tableau122333[[#This Row],[Priority (score + weigh)]],\"NA\")","v":9}]
[null,null,"10.A. System of performance indicators developed and validated by the directors of the network.",3,{"$f":"'Scoring criteria'!E134","v":0},"Section 10 question 1, 3, 4 and 5",3,{"$f":"Tableau122333[[#This Row],[Weigh]]*Tableau122333[[#This Row],[Score]]","v":0},{"$f":"Tableau122333[[#This Row],[Weigh]]*G85","v":9},{"$f":"IF(Tableau122333[[#This Row],[Score]]<>\"NA\",Tableau122333[[#This Row],[Maximum]]-Tableau122333[[#This Row],[Priority (score + weigh)]],\"NA\")","v":9}]
[null,null,"3.H Adequacy of material and financial resources at the field level ",3,{"$f":"'Scoring criteria'!E43","v":0},"Section 3 (part 3) question  4, 5 and 6",3,{"$f":"Tableau122333[[#This Row],[Weigh]]*Tableau122333[[#This Row],[Score]]","v":0},{"$f":"Tableau122333[[#This Row],[Weigh]]*G86","v":9},{"$f":"IF(Tableau122333[[#This Row],[Score]]<>\"NA\",Tableau122333[[#This Row],[Maximum]]-Tableau122333[[#This Row],[Priority (score + weigh)]],\"NA\")","v":9}]
[null,null,"7.D. Adequacy of material and financial resources for data management and analysis",3,{"$f":"'Scoring criteria'!E103","v":0},"Section 7 question 28, 50 and 51",3,{"$f":"Tableau122333[[#This Row],[Weigh]]*Tableau122333[[#This Row],[Score]]","v":0},{"$f":"Tableau122333[[#This Row],[Weigh]]*G87","v":9},{"$f":"IF(Tableau122333[[#This Row],[Score]]<>\"NA\",Tableau122333[[#This Row],[Maximum]]-Tableau122333[[#This Row],[Priority (score + weigh)]],\"NA\")","v":9}]
[null,null,"7.G. Exploitation of data fits the needs of the system (if possible regular and multi-disciplinary)",3,{"$f":"'Scoring criteria'!E106","v":0},"Section 7 question 31, 33 and 34",3,{"$f":"Tableau122333[[#This Row],[Weigh]]*Tableau122333[[#This Row],[Score]]","v":0},{"$f":"Tableau122333[[#This Row],[Weigh]]*G88","v":9},{"$f":"IF(Tableau122333[[#This Row],[Score]]<>\"NA\",Tableau122333[[#This Row],[Maximum]]-Tableau122333[[#This Row],[Priority (score + weigh)]],\"NA\")","v":9}]
[null,null,"7.C. Designated staff available and trained in data entry, management and analysis.",3,{"$f":"'Scoring criteria'!E102","v":1},"Section 7 question 52",3,{"$f":"Tableau122333[[#This Row],[Weigh]]*Tableau122333[[#This Row],[Score]]","v":3},{"$f":"Tableau122333[[#This Row],[Weigh]]*G89","v":9},{"$f":"IF(Tableau122333[[#This Row],[Score]]<>\"NA\",Tableau122333[[#This Row],[Maximum]]-Tableau122333[[#This Row],[Priority (score + weigh)]],\"NA\")","v":6}]
[null,null,"10.D. Implementation of corrective measures",3,{"$f":"'Scoring criteria'!E137","v":1},"Section 10 question 19 and 20",3,{"$f":"Tableau122333[[#This Row],[Weigh]]*Tableau122333[[#This Row],[Score]]","v":3},{"$f":"Tableau122333[[#This Row],[Weigh]]*G90","v":9},{"$f":"IF(Tableau122333[[#This Row],[Score]]<>\"NA\",Tableau122333[[#This Row],[Maximum]]-Tableau122333[[#This Row],[Priority (score + weigh)]],\"NA\")","v":6}]
[null,null,"8.B. Initial training implemented for all field agents when joining the system",3,{"$f":"'Scoring criteria'!E113","v":1},"Section 8 question 9 and 10",3,{"$f":"Tableau122333[[#This Row],[Weigh]]*Tableau122333[[#This Row],[Score]]","v":3},{"$f":"Tableau122333[[#This Row],[Weigh]]*G91","v":9},{"$f":"IF(Tableau122333[[#This Row],[Score]]<>\"NA\",Tableau122333[[#This Row],[Maximum]]-Tableau122333[[#This Row],[Priority (score + weigh)]],\"NA\")","v":6}]
[null,null,"10.C. External evaluations carried out",3,{"$f":"'Scoring criteria'!E136","v":1},"Section 10 question 12, 15 and 16",3,{"$f":"Tableau122333[[#This Row],[Weigh]]*Tableau122333[[#This Row],[Score]]","v":3},{"$f":"Tableau122333[[#This Row],[Weigh]]*G92","v":9},{"$f":"IF(Tableau122333[[#This Row],[Score]]<>\"NA\",Tableau122333[[#This Row],[Maximum]]-Tableau122333[[#This Row],[Priority (score + weigh)]],\"NA\")","v":6}]
[null,null,"7.E. Data verification and validation procedures formalized and operational",3,{"$f":"'Scoring criteria'!E104","v":1},"Section 7 question 25, 26 and 27",3,{"$f":"Tableau122333[[#This Row],[Weigh]]*Tableau122333[[#This Row],[Score]]","v":3},{"$f":"Tableau122333[[#This Row],[Weigh]]*G93","v":9},{"$f":"IF(Tableau122333[[#This Row],[Score]]<>\"NA\",Tableau122333[[#This Row],[Maximum]]-Tableau122333[[#This Row],[Priority (score + weigh)]],\"NA\")","v":6}]
[null,null,"8.A. Adequate skill level in epidemiology of members of the central unit",3,{"$f":"'Scoring criteria'!E112","v":1},"Section 8 question 2 and 4",3,{"$f":"Tableau122333[[#This Row],[Weigh]]*Tableau122333[[#This Row],[Score]]","v":3},{"$f":"Tableau122333[[#This Row],[Weigh]]*G94","v":9},{"$f":"IF(Tableau122333[[#This Row],[Score]]<>\"NA\",Tableau122333[[#This Row],[Maximum]]-Tableau122333[[#This Row],[Priority (score + weigh)]],\"NA\")","v":6}]
[null,null,"4.H Sensitivity of diagnostic techniques",3,{"$f":"'Scoring criteria'!E56","v":1.5},"Section 4 table at the end of the section column b",3,{"$f":"Tableau122333[[#This Row],[Weigh]]*Tableau122333[[#This Row],[Score]]","v":4.5},{"$f":"Tableau122333[[#This Row],[Weigh]]*G95","v":9},{"$f":"IF(Tableau122333[[#This Row],[Score]]<>\"NA\",Tableau122333[[#This Row],[Maximum]]-Tableau122333[[#This Row],[Priority (score + weigh)]],\"NA\")","v":4.5}]
[null,null,"4.I Specificity of diagnostic techniques",3,{"$f":"'Scoring criteria'!E57","v":1.5},"Section 4 table at the end of the section column c",3,{"$f":"Tableau122333[[#This Row],[Weigh]]*Tableau122333[[#This Row],[Score]]","v":4.5},{"$f":"Tableau122333[[#This Row],[Weigh]]*G96","v":9},{"$f":"IF(Tableau122333[[#This Row],[Score]]<>\"NA\",Tableau122333[[#This Row],[Maximum]]-Tableau122333[[#This Row],[Priority (score + weigh)]],\"NA\")","v":4.5}]
[null,null,"4.K Technical level of data management at the laboratory",3,{"$f":"'Scoring criteria'!E59","v":1.5},"Section 4 question 15, 18 and 45",3,{"$f":"Tableau122333[[#This Row],[Weigh]]*Tableau122333[[#This Row],[Score]]","v":4.5},{"$f":"Tableau122333[[#This Row],[Weigh]]*G97","v":9},{"$f":"IF(Tableau122333[[#This Row],[Score]]<>\"NA\",Tableau122333[[#This Row],[Maximum]]-Tableau122333[[#This Row],[Priority (score + weigh)]],\"NA\")","v":4.5}]
[null,null,"8.E. Adequacy of material and financial resources for training",2,{"$f":"'Scoring criteria'!E116","v":1},"Section 8 question 19",3,{"$f":"Tableau122333[[#This Row],[Weigh]]*Tableau122333[[#This Row],[Score]]","v":2},{"$f":"Tableau122333[[#This Row],[Weigh]]*G98","v":6},{"$f":"IF(Tableau122333[[#This Row],[Score]]<>\"NA\",Tableau122333[[#This Row],[Maximum]]-Tableau122333[[#This Row],[Priority (score + weigh)]],\"NA\")","v":4}]
[null,null,"2.F Supervision of intermediary units by the central level",3,{"$f":"'Scoring criteria'!E29","v":2},"Section 2 question 68, 70 and 73",3,{"$f":"Tableau122333[[#This Row],[Weigh]]*Tableau122333[[#This Row],[Score]]","v":6},{"$f":"Tableau122333[[#This Row],[Weigh]]*G99","v":9},{"$f":"IF(Tableau122333[[#This Row],[Score]]<>\"NA\",Tableau122333[[#This Row],[Maximum]]-Tableau122333[[#This Row],[Priority (score + weigh)]],\"NA\")","v":3}]
[null,null,"5.A Existence of a formalized surveillance protocol for each disease or threat under surveillance",3,{"$f":"'Scoring criteria'!E67","v":2},"Section 5 (part 1) question 1 and 2 to 13",3,{"$f":"Tableau122333[[#This Row],[Weigh]]*Tableau122333[[#This Row],[Score]]","v":6},{"$f":"Tableau122333[[#This Row],[Weigh]]*G100","v":9},{"$f":"IF(Tableau122333[[#This Row],[Score]]<>\"NA\",Tableau122333[[#This Row],[Maximum]]-Tableau122333[[#This Row],[Priority (score + weigh)]],\"NA\")","v":3}]
[null,null,"2.C Existence of a scientific and technical committee for the system",3,{"$f":"'Scoring criteria'!E26","v":2},"Section 2 question 42, 45, 46, 48, 52 and 54",3,{"$f":"Tableau122333[[#This Row],[Weigh]]*Tableau122333[[#This Row],[Score]]","v":6},{"$f":"Tableau122333[[#This Row],[Weigh]]*G101","v":9},{"$f":"IF(Tableau122333[[#This Row],[Score]]<>\"NA\",Tableau122333[[#This Row],[Maximum]]-Tableau122333[[#This Row],[Priority (score + weigh)]],\"NA\")","v":3}]
[null,null,"4.L Analysis deadlines at the laboratory (formalization, standardization, verification, transfer of results to the central unit)",1,{"$f":"'Scoring criteria'!E60","v":0},"Section 4 table at the end of the section column j and k and question 20 and 47",3,{"$f":"Tableau122333[[#This Row],[Weigh]]*Tableau122333[[#This Row],[Score]]","v":0},{"$f":"Tableau122333[[#This Row],[Weigh]]*G102","v":3},{"$f":"IF(Tableau122333[[#This Row],[Score]]<>\"NA\",Tableau122333[[#This Row],[Maximum]]-Tableau122333[[#This Row],[Priority (score + weigh)]],\"NA\")","v":3}]
[null,null,"8.C. Objectives and contents of initial training of system field actors adequate for operational surveillance needs",3,{"$f":"'Scoring criteria'!E114","v":2.5},"Section 8 question 11",3,{"$f":"Tableau122333[[#This Row],[Weigh]]*Tableau122333[[#This Row],[Score]]","v":7.5},{"$f":"Tableau122333[[#This Row],[Weigh]]*G103","v":9},{"$f":"IF(Tableau122333[[#This Row],[Score]]<>\"NA\",Tableau122333[[#This Row],[Maximum]]-Tableau122333[[#This Row],[Priority (score + weigh)]],\"NA\")","v":1.5}]
[null,null,"5.H Relevance of collected  samples",3,{"$f":"'Scoring criteria'!E74","v":2.5},"Section 5 (part 1) question 24, Section 5 (part 2) question 9 Section 5 (part 3) Quesstion 14 section 1 question 1 and 3",3,{"$f":"Tableau122333[[#This Row],[Weigh]]*Tableau122333[[#This Row],[Score]]","v":7.5},{"$f":"Tableau122333[[#This Row],[Weigh]]*G104","v":9},{"$f":"IF(Tableau122333[[#This Row],[Score]]<>\"NA\",Tableau122333[[#This Row],[Maximum]]-Tableau122333[[#This Row],[Priority (score + weigh)]],\"NA\")","v":1.5}]
[null,null,"3.F Existence of coordination meetings at the intermediate level",1,{"$f":"'Scoring criteria'!E41","v":2},"Section 3 (part 1) question 18, 21, 28, 30 and 32",3,{"$f":"Tableau122333[[#This Row],[Weigh]]*Tableau122333[[#This Row],[Score]]","v":2},{"$f":"Tableau122333[[#This Row],[Weigh]]*G105","v":3},{"$f":"IF(Tableau122333[[#This Row],[Score]]<>\"NA\",Tableau122333[[#This Row],[Maximum]]-Tableau122333[[#This Row],[Priority (score + weigh)]],\"NA\")","v":1}]
[null,null,"3.C Implementation of supervision by the intermediary level\n",3,{"$f":"'Scoring criteria'!E38","v":2.75},"Section 3 (part 2) question 5, 7 and 9",3,{"$f":"Tableau122333[[#This Row],[Weigh]]*Tableau122333[[#This Row],[Score]]","v":8.25},{"$f":"Tableau122333[[#This Row],[Weigh]]*G106","v":9},{"$f":"IF(Tableau122333[[#This Row],[Score]]<>\"NA\",Tableau122333[[#This Row],[Maximum]]-Tableau122333[[#This Row],[Priority (score + weigh)]],\"NA\")","v":0.75}]
[null,null,"1.A           Relevance of surveillance objectives",3,{"$f":"'Scoring criteria'!E15","v":3},"Section 1 question 1 and 3",3,{"$f":"Tableau122333[[#This Row],[Weigh]]*Tableau122333[[#This Row],[Score]]","v":9},{"$f":"Tableau122333[[#This Row],[Weigh]]*G107","v":9},{"$f":"IF(Tableau122333[[#This Row],[Score]]<>\"NA\",Tableau122333[[#This Row],[Maximum]]-Tableau122333[[#This Row],[Priority (score + weigh)]],\"NA\")","v":0}]
[null,null,"4.D Quality of the standardization of work between different laboratories",3,{"$f":"'Scoring criteria'!E52","v":3},"Section 4 question 3, 21, 48 and 49",3,{"$f":"Tableau122333[[#This Row],[Weigh]]*Tableau122333[[#This Row],[Score]]","v":9},{"$f":"Tableau122333[[#This Row],[Weigh]]*G108","v":9},{"$f":"IF(Tableau122333[[#This Row],[Score]]<>\"NA\",Tableau122333[[#This Row],[Maximum]]-Tableau122333[[#This Row],[Priority (score + weigh)]],\"NA\")","v":0}]
[null,null,"4.E Proportion of tests submitted to inter-laboratory trials",3,{"$f":"'Scoring criteria'!E52","v":3},"Section 4 table at the end of the section column m",3,{"$f":"Tableau122333[[#This Row],[Weigh]]*Tableau122333[[#This Row],[Score]]","v":9},{"$f":"Tableau122333[[#This Row],[Weigh]]*G109","v":9},{"$f":"IF(Tableau122333[[#This Row],[Score]]<>\"NA\",Tableau122333[[#This Row],[Maximum]]-Tableau122333[[#This Row],[Priority (score + weigh)]],\"NA\")","v":0}]
[null,null,"4.A Effective integration of laboratories in the surveillance system",3,{"$f":"'Scoring criteria'!E49","v":3},"Section 4 question 1 and 2",3,{"$f":"Tableau122333[[#This Row],[Weigh]]*Tableau122333[[#This Row],[Score]]","v":9},{"$f":"Tableau122333[[#This Row],[Weigh]]*G110","v":9},{"$f":"IF(Tableau122333[[#This Row],[Score]]<>\"NA\",Tableau122333[[#This Row],[Maximum]]-Tableau122333[[#This Row],[Priority (score + weigh)]],\"NA\")","v":0}]
[null,null,"4.C Application of Quality Assurance for the tests undertaken",3,{"$f":"'Scoring criteria'!E51","v":3},"Section 4 table at the end of the section column l",3,{"$f":"Tableau122333[[#This Row],[Weigh]]*Tableau122333[[#This Row],[Score]]","v":9},{"$f":"Tableau122333[[#This Row],[Weigh]]*G111","v":9},{"$f":"IF(Tableau122333[[#This Row],[Score]]<>\"NA\",Tableau122333[[#This Row],[Maximum]]-Tableau122333[[#This Row],[Priority (score + weigh)]],\"NA\")","v":0}]
[null,null,"4.J Control of laboratory reagents",3,{"$f":"'Scoring criteria'!E58","v":3},"Section 4 question 23 and 51",3,{"$f":"Tableau122333[[#This Row],[Weigh]]*Tableau122333[[#This Row],[Score]]","v":9},{"$f":"Tableau122333[[#This Row],[Weigh]]*G112","v":9},{"$f":"IF(Tableau122333[[#This Row],[Score]]<>\"NA\",Tableau122333[[#This Row],[Maximum]]-Tableau122333[[#This Row],[Priority (score + weigh)]],\"NA\")","v":0}]
[null,null,"7.A. Adequacy of the data management system for the needs of the system (relational database, etc.)",3,{"$f":"'Scoring criteria'!E100","v":3},"Section 7 question 3, 8 and 9 ",3,{"$f":"Tableau122333[[#This Row],[Weigh]]*Tableau122333[[#This Row],[Score]]","v":9},{"$f":"Tableau122333[[#This Row],[Weigh]]*G113","v":9},{"$f":"IF(Tableau122333[[#This Row],[Score]]<>\"NA\",Tableau122333[[#This Row],[Maximum]]-Tableau122333[[#This Row],[Priority (score + weigh)]],\"NA\")","v":0}]
[null,null,"3.A Existence of formal intermediary units covering the entire territory",2,{"$f":"'Scoring criteria'!E36","v":3},"Section 3 (part 1) question 1, 8 and 5",3,{"$f":"Tableau122333[[#This Row],[Weigh]]*Tableau122333[[#This Row],[Score]]","v":6},{"$f":"Tableau122333[[#This Row],[Weigh]]*G114","v":6},{"$f":"IF(Tableau122333[[#This Row],[Score]]<>\"NA\",Tableau122333[[#This Row],[Maximum]]-Tableau122333[[#This Row],[Priority (score + weigh)]],\"NA\")","v":0}]
[null,null,"1.B           Level of detail, accuracy, and formalization of objectives",3,{"$f":"'Scoring criteria'!E16","v":3},"Section 1 question 1 and 2",3,{"$f":"Tableau122333[[#This Row],[Weigh]]*Tableau122333[[#This Row],[Score]]","v":9},{"$f":"Tableau122333[[#This Row],[Weigh]]*G115","v":9},{"$f":"IF(Tableau122333[[#This Row],[Score]]<>\"NA\",Tableau122333[[#This Row],[Maximum]]-Tableau122333[[#This Row],[Priority (score + weigh)]],\"NA\")","v":0}]
[null,null,"5.J Quality of samples collected",3,{"$f":"'Scoring criteria'!E76","v":3},"Section 5 (part 1) question 28",3,{"$f":"Tableau122333[[#This Row],[Weigh]]*Tableau122333[[#This Row],[Score]]","v":9},{"$f":"Tableau122333[[#This Row],[Weigh]]*G116","v":9},{"$f":"IF(Tableau122333[[#This Row],[Score]]<>\"NA\",Tableau122333[[#This Row],[Maximum]]-Tableau122333[[#This Row],[Priority (score + weigh)]],\"NA\")","v":0}]
[null,null,"3.B Active role of intermediary units in the functioning of the system (validation, management, feedback)",2,{"$f":"'Scoring criteria'!E37","v":3},"Section 3 (part 2) question 1",3,{"$f":"Tableau122333[[#This Row],[Weigh]]*Tableau122333[[#This Row],[Score]]","v":6},{"$f":"Tableau122333[[#This Row],[Weigh]]*G117","v":6},{"$f":"IF(Tableau122333[[#This Row],[Score]]<>\"NA\",Tableau122333[[#This Row],[Maximum]]-Tableau122333[[#This Row],[Priority (score + weigh)]],\"NA\")","v":0}]
[null,null,"4.F Existence of an investigation team to support field agents",1,{"$f":"'Scoring criteria'!E53","v":3},"Section 4 question 52 and 53",3,{"$f":"Tableau122333[[#This Row],[Weigh]]*Tableau122333[[#This Row],[Score]]","v":3},{"$f":"Tableau122333[[#This Row],[Weigh]]*G118","v":3},{"$f":"IF(Tableau122333[[#This Row],[Score]]<>\"NA\",Tableau122333[[#This Row],[Maximum]]-Tableau122333[[#This Row],[Priority (score + weigh)]],\"NA\")","v":0}]
[null,null,"4.G Relevance of diagnostic techniques",3,{"$f":"'Scoring criteria'!E55","v":3},"Section 4 question 54, 55 and 56",3,{"$f":"Tableau122333[[#This Row],[Weigh]]*Tableau122333[[#This Row],[Score]]","v":9},{"$f":"Tableau122333[[#This Row],[Weigh]]*G119","v":9},{"$f":"IF(Tableau122333[[#This Row],[Score]]<>\"NA\",Tableau122333[[#This Row],[Maximum]]-Tableau122333[[#This Row],[Priority (score + weigh)]],\"NA\")","v":0}]
[null,null,"4.M Quality of results delivered",3,{"$f":"'Scoring criteria'!E61","v":3},"Section 4 question 58 and 59",3,{"$f":"Tableau122333[[#This Row],[Weigh]]*Tableau122333[[#This Row],[Score]]","v":9},{"$f":"Tableau122333[[#This Row],[Weigh]]*G120","v":9},{"$f":"IF(Tableau122333[[#This Row],[Score]]<>\"NA\",Tableau122333[[#This Row],[Maximum]]-Tableau122333[[#This Row],[Priority (score + weigh)]],\"NA\")","v":0}]
[null,null,"5.B Standardization of data collected",3,{"$f":"'Scoring criteria'!E68","v":3},"Section 5 (part 1) question 14, 19, 20, 22 and 23",3,{"$f":"Tableau122333[[#This Row],[Weigh]]*Tableau122333[[#This Row],[Score]]","v":9},{"$f":"Tableau122333[[#This Row],[Weigh]]*G121","v":9},{"$f":"IF(Tableau122333[[#This Row],[Score]]<>\"NA\",Tableau122333[[#This Row],[Maximum]]-Tableau122333[[#This Row],[Priority (score + weigh)]],\"NA\")","v":0}]
[null,null,"5.C Relevance of measurement tools (excluding laboratory tools)",3,{"$f":"'Scoring criteria'!E69","v":3},"Section 5 (part 2) question 6, Section 5 (part 3) question 9 and section 1 question 1 ",3,{"$f":"Tableau122333[[#This Row],[Weigh]]*Tableau122333[[#This Row],[Score]]","v":9},{"$f":"Tableau122333[[#This Row],[Weigh]]*G122","v":9},{"$f":"IF(Tableau122333[[#This Row],[Score]]<>\"NA\",Tableau122333[[#This Row],[Maximum]]-Tableau122333[[#This Row],[Priority (score + weigh)]],\"NA\")","v":0}]
[null,null,"5.G Quality of the filling out of investigation forms",3,{"$f":"'Scoring criteria'!E73","v":3},"Section 5 (part 1) question 19 and 21",3,{"$f":"Tableau122333[[#This Row],[Weigh]]*Tableau122333[[#This Row],[Score]]","v":9},{"$f":"Tableau122333[[#This Row],[Weigh]]*G123","v":9},{"$f":"IF(Tableau122333[[#This Row],[Score]]<>\"NA\",Tableau122333[[#This Row],[Maximum]]-Tableau122333[[#This Row],[Priority (score + weigh)]],\"NA\")","v":0}]
[null,null,"5.I Standardization of collected samples",3,{"$f":"'Scoring criteria'!E75","v":3},"Section 5 (part 1) question 25 and 26",3,{"$f":"Tableau122333[[#This Row],[Weigh]]*Tableau122333[[#This Row],[Score]]","v":9},{"$f":"Tableau122333[[#This Row],[Weigh]]*G124","v":9},{"$f":"IF(Tableau122333[[#This Row],[Score]]<>\"NA\",Tableau122333[[#This Row],[Maximum]]-Tableau122333[[#This Row],[Priority (score + weigh)]],\"NA\")","v":0}]
[]
[]
[null,null,"Stability"]
[null,null,"Criteria","Weigh","Score","Referencing question","Max","Priority (score + weigh)","Maximum","Missing points"]
[null,null,"2.G Adequacy of the central level’s material and financial resources  \n",3,{"$f":"'Scoring criteria'!E30","v":0},"Section 2 question 23, 26, 40 and 55 ",3,{"$f":"Tableau33[[#This Row],[Weigh]]*Tableau33[[#This Row],[Score]]","v":0},{"$f":"Tableau33[[#This Row],[Weigh]]*G129","v":9},{"$f":"IF(Tableau33[[#This Row],[Score]]<>\"NA\",Tableau33[[#This Row],[Maximum]]-Tableau33[[#This Row],[Priority (score + weigh)]],\"NA\")","v":9}]
[null,null,"4.B Adequacy of human, material, and financial resources for diagnostic needs",3,{"$f":"'Scoring criteria'!E50","v":0},"Section 4 question 8, 9, 10, 35, 36 and 37",3,{"$f":"Tableau33[[#This Row],[Weigh]]*Tableau33[[#This Row],[Score]]","v":0},{"$f":"Tableau33[[#This Row],[Weigh]]*G130","v":9},{"$f":"IF(Tableau33[[#This Row],[Score]]<>\"NA\",Tableau33[[#This Row],[Maximum]]-Tableau33[[#This Row],[Priority (score + weigh)]],\"NA\")","v":9}]
[null,null,"2.D Organization and operations of the system laid down in regulations, a charter, or a convention established between the partners",3,{"$f":"'Scoring criteria'!E27","v":0},"Section 2 question 57, 58 and 59",3,{"$f":"Tableau33[[#This Row],[Weigh]]*Tableau33[[#This Row],[Score]]","v":0},{"$f":"Tableau33[[#This Row],[Weigh]]*G131","v":9},{"$f":"IF(Tableau33[[#This Row],[Score]]<>\"NA\",Tableau33[[#This Row],[Maximum]]-Tableau33[[#This Row],[Priority (score + weigh)]],\"NA\")","v":9}]
[null,null,"3.H Adequacy of material and financial resources at the field level ",3,{"$f":"'Scoring criteria'!E43","v":0},"Section 3 (part 3) question  4, 5 and 6",3,{"$f":"Tableau33[[#This Row],[Weigh]]*Tableau33[[#This Row],[Score]]","v":0},{"$f":"Tableau33[[#This Row],[Weigh]]*G132","v":9},{"$f":"IF(Tableau33[[#This Row],[Score]]<>\"NA\",Tableau33[[#This Row],[Maximum]]-Tableau33[[#This Row],[Priority (score + weigh)]],\"NA\")","v":9}]
[null,null,"2.A Existence of an operational management structure (central unit)",3,{"$f":"'Scoring criteria'!E24","v":0.5},"Section 2 question 7, 9, 10, 20 and 22",3,{"$f":"Tableau33[[#This Row],[Weigh]]*Tableau33[[#This Row],[Score]]","v":1.5},{"$f":"Tableau33[[#This Row],[Weigh]]*G133","v":9},{"$f":"IF(Tableau33[[#This Row],[Score]]<>\"NA\",Tableau33[[#This Row],[Maximum]]-Tableau33[[#This Row],[Priority (score + weigh)]],\"NA\")","v":7.5}]
[null,null,"2.B Existence of an operational steering structure that is representative of the partners (steering committee)",3,{"$f":"'Scoring criteria'!E25","v":1},"Section 2 question 28/29, 31, 34, 37, 38 and 39",3,{"$f":"Tableau33[[#This Row],[Weigh]]*Tableau33[[#This Row],[Score]]","v":3},{"$f":"Tableau33[[#This Row],[Weigh]]*G134","v":9},{"$f":"IF(Tableau33[[#This Row],[Score]]<>\"NA\",Tableau33[[#This Row],[Maximum]]-Tableau33[[#This Row],[Priority (score + weigh)]],\"NA\")","v":6}]
[null,null,"3.D Harmonization of intermediary units’ activities",2,{"$f":"'Scoring criteria'!E39","v":0},"section 3 (part 1) question 12, 13 and 14",3,{"$f":"Tableau33[[#This Row],[Weigh]]*Tableau33[[#This Row],[Score]]","v":0},{"$f":"Tableau33[[#This Row],[Weigh]]*G135","v":6},{"$f":"IF(Tableau33[[#This Row],[Score]]<>\"NA\",Tableau33[[#This Row],[Maximum]]-Tableau33[[#This Row],[Priority (score + weigh)]],\"NA\")","v":6}]
[null,null,"3.E Adequacy of material and financial resources of intermediary units ",2,{"$f":"'Scoring criteria'!E40","v":0},"Section 3 (part 2) question 2, 3 and 4",3,{"$f":"Tableau33[[#This Row],[Weigh]]*Tableau33[[#This Row],[Score]]","v":0},{"$f":"Tableau33[[#This Row],[Weigh]]*G136","v":6},{"$f":"IF(Tableau33[[#This Row],[Score]]<>\"NA\",Tableau33[[#This Row],[Maximum]]-Tableau33[[#This Row],[Priority (score + weigh)]],\"NA\")","v":6}]
[null,null,"8.D. Regular advanced training",2,{"$f":"'Scoring criteria'!E115","v":0},"Section 8 question 14 and 20",3,{"$f":"Tableau33[[#This Row],[Weigh]]*Tableau33[[#This Row],[Score]]","v":0},{"$f":"Tableau33[[#This Row],[Weigh]]*G137","v":6},{"$f":"IF(Tableau33[[#This Row],[Score]]<>\"NA\",Tableau33[[#This Row],[Maximum]]-Tableau33[[#This Row],[Priority (score + weigh)]],\"NA\")","v":6}]
[null,null,"9.A Regular release of reports and scientific articles on surveillance results",2,{"$f":"'Scoring criteria'!E122","v":0},"Section 9 question 9, 10 and 11",3,{"$f":"Tableau33[[#This Row],[Weigh]]*Tableau33[[#This Row],[Score]]","v":0},{"$f":"Tableau33[[#This Row],[Weigh]]*G138","v":6},{"$f":"IF(Tableau33[[#This Row],[Score]]<>\"NA\",Tableau33[[#This Row],[Maximum]]-Tableau33[[#This Row],[Priority (score + weigh)]],\"NA\")","v":6}]
[null,null,"7.D. Adequacy of material and financial resources for data management and analysis",2,{"$f":"'Scoring criteria'!E103","v":0},"Section 7 question 28, 50 and 51",3,{"$f":"Tableau33[[#This Row],[Weigh]]*Tableau33[[#This Row],[Score]]","v":0},{"$f":"Tableau33[[#This Row],[Weigh]]*G139","v":6},{"$f":"IF(Tableau33[[#This Row],[Score]]<>\"NA\",Tableau33[[#This Row],[Maximum]]-Tableau33[[#This Row],[Priority (score + weigh)]],\"NA\")","v":6}]
[null,null,"9.G. Adequacy of material and financial resources for communication",2,{"$f":"'Scoring criteria'!E128","v":0},"Section 9 question 42, 43 and 44",3,{"$f":"Tableau33[[#This Row],[Weigh]]*Tableau33[[#This Row],[Score]]","v":0},{"$f":"Tableau33[[#This Row],[Weigh]]*G140","v":6},{"$f":"IF(Tableau33[[#This Row],[Score]]<>\"NA\",Tableau33[[#This Row],[Maximum]]-Tableau33[[#This Row],[Priority (score + weigh)]],\"NA\")","v":6}]
[null,null,"5.A Existence of a formalized surveillance protocol for each disease or threat under surveillance",3,{"$f":"'Scoring criteria'!E67","v":2},"Section 5 (part 1) question 1 and 2 to 13",3,{"$f":"Tableau33[[#This Row],[Weigh]]*Tableau33[[#This Row],[Score]]","v":6},{"$f":"Tableau33[[#This Row],[Weigh]]*G141","v":9},{"$f":"IF(Tableau33[[#This Row],[Score]]<>\"NA\",Tableau33[[#This Row],[Maximum]]-Tableau33[[#This Row],[Priority (score + weigh)]],\"NA\")","v":3}]
[null,null,"9.C. Regular dissemination of a relevant information bulletin",2,{"$f":"'Scoring criteria'!E124","v":1.5},"Section 9 question 33, 34, 35, 36 and 40",3,{"$f":"Tableau33[[#This Row],[Weigh]]*Tableau33[[#This Row],[Score]]","v":3},{"$f":"Tableau33[[#This Row],[Weigh]]*G142","v":6},{"$f":"IF(Tableau33[[#This Row],[Score]]<>\"NA\",Tableau33[[#This Row],[Maximum]]-Tableau33[[#This Row],[Priority (score + weigh)]],\"NA\")","v":3}]
[null,null,"2.C Existence of a scientific and technical committee for the system",3,{"$f":"'Scoring criteria'!E26","v":2},"Section 2 question 41, 45, 46, 48, 52 and 54",3,{"$f":"Tableau33[[#This Row],[Weigh]]*Tableau33[[#This Row],[Score]]","v":6},{"$f":"Tableau33[[#This Row],[Weigh]]*G143","v":9},{"$f":"IF(Tableau33[[#This Row],[Score]]<>\"NA\",Tableau33[[#This Row],[Maximum]]-Tableau33[[#This Row],[Priority (score + weigh)]],\"NA\")","v":3}]
[null,null,"4.D Quality of the standardization of work between different laboratories",3,{"$f":"'Scoring criteria'!E52","v":3},"Section 4 question 3, 21, 48 and 49",3,{"$f":"Tableau33[[#This Row],[Weigh]]*Tableau33[[#This Row],[Score]]","v":9},{"$f":"Tableau33[[#This Row],[Weigh]]*G144","v":9},{"$f":"IF(Tableau33[[#This Row],[Score]]<>\"NA\",Tableau33[[#This Row],[Maximum]]-Tableau33[[#This Row],[Priority (score + weigh)]],\"NA\")","v":0}]
[null,null,"9.B. Return of individual test results to field actors",3,{"$f":"'Scoring criteria'!E123","v":3},"Section 9 question 14",3,{"$f":"Tableau33[[#This Row],[Weigh]]*Tableau33[[#This Row],[Score]]","v":9},{"$f":"Tableau33[[#This Row],[Weigh]]*G145","v":9},{"$f":"IF(Tableau33[[#This Row],[Score]]<>\"NA\",Tableau33[[#This Row],[Maximum]]-Tableau33[[#This Row],[Priority (score + weigh)]],\"NA\")","v":0}]
[null,null,"4.C Application of Quality Assurance for the tests undertaken",3,{"$f":"'Scoring criteria'!E51","v":3},"Section 4 table at the end of the section column l",3,{"$f":"Tableau33[[#This Row],[Weigh]]*Tableau33[[#This Row],[Score]]","v":9},{"$f":"Tableau33[[#This Row],[Weigh]]*G146","v":9},{"$f":"IF(Tableau33[[#This Row],[Score]]<>\"NA\",Tableau33[[#This Row],[Maximum]]-Tableau33[[#This Row],[Priority (score + weigh)]],\"NA\")","v":0}]
[null,null,"4.E Proportion of tests submitted to inter-laboratory trials",3,{"$f":"'Scoring criteria'!E53","v":3},"Section 4 table at the end of the section column m",3,{"$f":"Tableau33[[#This Row],[Weigh]]*Tableau33[[#This Row],[Score]]","v":9},{"$f":"Tableau33[[#This Row],[Weigh]]*G147","v":9},{"$f":"IF(Tableau33[[#This Row],[Score]]<>\"NA\",Tableau33[[#This Row],[Maximum]]-Tableau33[[#This Row],[Priority (score + weigh)]],\"NA\")","v":0}]
[null,null,"4.J Control of laboratory reagents",3,{"$f":"'Scoring criteria'!E58","v":3},"Section 4 question 23 and 51",3,{"$f":"Tableau33[[#This Row],[Weigh]]*Tableau33[[#This Row],[Score]]","v":9},{"$f":"Tableau33[[#This Row],[Weigh]]*G148","v":9},{"$f":"IF(Tableau33[[#This Row],[Score]]<>\"NA\",Tableau33[[#This Row],[Maximum]]-Tableau33[[#This Row],[Priority (score + weigh)]],\"NA\")","v":0}]
[null,null,"3.A Existence of formal intermediary units covering the entire territory",2,{"$f":"'Scoring criteria'!E36","v":3},"Section 3 (part 1) question 1, 8 and 5",3,{"$f":"Tableau33[[#This Row],[Weigh]]*Tableau33[[#This Row],[Score]]","v":6},{"$f":"Tableau33[[#This Row],[Weigh]]*G149","v":6},{"$f":"IF(Tableau33[[#This Row],[Score]]<>\"NA\",Tableau33[[#This Row],[Maximum]]-Tableau33[[#This Row],[Priority (score + weigh)]],\"NA\")","v":0}]
[null,null,"7.A. Adequacy of the data management system for the needs of the system (relational database, etc.)",1,{"$f":"'Scoring criteria'!E100","v":3},"Section 7 question 3, 8 and 9 ",3,{"$f":"Tableau33[[#This Row],[Weigh]]*Tableau33[[#This Row],[Score]]","v":3},{"$f":"Tableau33[[#This Row],[Weigh]]*G150","v":3},{"$f":"IF(Tableau33[[#This Row],[Score]]<>\"NA\",Tableau33[[#This Row],[Maximum]]-Tableau33[[#This Row],[Priority (score + weigh)]],\"NA\")","v":0}]
[null,null,"1.C           Taking partners’ expectations into account",3,{"$f":"'Scoring criteria'!E17","v":3},"Section 1 question 4",3,{"$f":"Tableau33[[#This Row],[Weigh]]*Tableau33[[#This Row],[Score]]","v":9},{"$f":"Tableau33[[#This Row],[Weigh]]*G151","v":9},{"$f":"IF(Tableau33[[#This Row],[Score]]<>\"NA\",Tableau33[[#This Row],[Maximum]]-Tableau33[[#This Row],[Priority (score + weigh)]],\"NA\")","v":0}]
[null,null,"5.B Standardization of data collected",3,{"$f":"'Scoring criteria'!E68","v":3},"Section 5 question 14, 23, 24, 33 and 34",3,{"$f":"Tableau33[[#This Row],[Weigh]]*Tableau33[[#This Row],[Score]]","v":9},{"$f":"Tableau33[[#This Row],[Weigh]]*G152","v":9},{"$f":"IF(Tableau33[[#This Row],[Score]]<>\"NA\",Tableau33[[#This Row],[Maximum]]-Tableau33[[#This Row],[Priority (score + weigh)]],\"NA\")","v":0}]
[]
[]
[null,null,"Acceptability"]
[null,null,"Criteria","Weigh","Score","Referencing question","Max","Priority (score + weigh)","Maximum","Missing points"]
[null,null,"2.D Organization and operations of the system laid down in regulations, a charter, or a convention established between the partners",3,{"$f":"'Scoring criteria'!E27","v":0},"Section 2 question 57, 58 and 59",3,{"$f":"Tableau34[[#This Row],[Weigh]]*Tableau34[[#This Row],[Score]]","v":0},{"$f":"Tableau34[[#This Row],[Weigh]]*G157","v":9},{"$f":"IF(Tableau34[[#This Row],[Score]]<>\"NA\",Tableau34[[#This Row],[Maximum]]-Tableau34[[#This Row],[Priority (score + weigh)]],\"NA\")","v":9}]
[null,null,"9.A Regular release of reports and scientific articles on surveillance results",3,{"$f":"'Scoring criteria'!E122","v":0},"Section 9 question 9, 10 and 11",3,{"$f":"Tableau34[[#This Row],[Weigh]]*Tableau34[[#This Row],[Score]]","v":0},{"$f":"Tableau34[[#This Row],[Weigh]]*G158","v":9},{"$f":"IF(Tableau34[[#This Row],[Score]]<>\"NA\",Tableau34[[#This Row],[Maximum]]-Tableau34[[#This Row],[Priority (score + weigh)]],\"NA\")","v":9}]
[null,null,"3.H Adequacy of material and financial resources at the field level ",3,{"$f":"'Scoring criteria'!E43","v":0},"Section 3 (part 3) question  4, 5 and 6",3,{"$f":"Tableau34[[#This Row],[Weigh]]*Tableau34[[#This Row],[Score]]","v":0},{"$f":"Tableau34[[#This Row],[Weigh]]*G159","v":9},{"$f":"IF(Tableau34[[#This Row],[Score]]<>\"NA\",Tableau34[[#This Row],[Maximum]]-Tableau34[[#This Row],[Priority (score + weigh)]],\"NA\")","v":9}]
[null,null,"2.A Existence of an operational management structure (central unit)",3,{"$f":"'Scoring criteria'!E24","v":0.5},"Section 2 question 7, 9, 10, 20 and 22",3,{"$f":"Tableau34[[#This Row],[Weigh]]*Tableau34[[#This Row],[Score]]","v":1.5},{"$f":"Tableau34[[#This Row],[Weigh]]*G160","v":9},{"$f":"IF(Tableau34[[#This Row],[Score]]<>\"NA\",Tableau34[[#This Row],[Maximum]]-Tableau34[[#This Row],[Priority (score + weigh)]],\"NA\")","v":7.5}]
[null,null,"2.B Existence of an operational steering structure that is representative of the partners (steering committee)",3,{"$f":"'Scoring criteria'!E25","v":1},"Section 2 question 28/29, 31, 34, 37, 38 and 39",3,{"$f":"Tableau34[[#This Row],[Weigh]]*Tableau34[[#This Row],[Score]]","v":3},{"$f":"Tableau34[[#This Row],[Weigh]]*G161","v":9},{"$f":"IF(Tableau34[[#This Row],[Score]]<>\"NA\",Tableau34[[#This Row],[Maximum]]-Tableau34[[#This Row],[Priority (score + weigh)]],\"NA\")","v":6}]
[null,null,"3.E Adequacy of material and financial resources of intermediary units ",2,{"$f":"'Scoring criteria'!E40","v":0},"Section 3 (part 2) question 2, 3 and 4",3,{"$f":"Tableau34[[#This Row],[Weigh]]*Tableau34[[#This Row],[Score]]","v":0},{"$f":"Tableau34[[#This Row],[Weigh]]*G162","v":6},{"$f":"IF(Tableau34[[#This Row],[Score]]<>\"NA\",Tableau34[[#This Row],[Maximum]]-Tableau34[[#This Row],[Priority (score + weigh)]],\"NA\")","v":6}]
[null,null,"8.B. Initial training implemented for all field agents when joining the system",3,{"$f":"'Scoring criteria'!E113","v":1},"Section 8 question 9 and 10",3,{"$f":"Tableau34[[#This Row],[Weigh]]*Tableau34[[#This Row],[Score]]","v":3},{"$f":"Tableau34[[#This Row],[Weigh]]*G163","v":9},{"$f":"IF(Tableau34[[#This Row],[Score]]<>\"NA\",Tableau34[[#This Row],[Maximum]]-Tableau34[[#This Row],[Priority (score + weigh)]],\"NA\")","v":6}]
[null,null,"6.C Existence of awareness building programs for data sources in a passive (event-based) network ",3,{"$f":"'Scoring criteria'!E88","v":2},"Section 5 (part 1) question 61 and section 5 (part 3) question 23, 24 and 37",3,{"$f":"Tableau34[[#This Row],[Weigh]]*Tableau34[[#This Row],[Score]]","v":6},{"$f":"Tableau34[[#This Row],[Weigh]]*G164","v":9},{"$f":"IF(Tableau34[[#This Row],[Score]]<>\"NA\",Tableau34[[#This Row],[Maximum]]-Tableau34[[#This Row],[Priority (score + weigh)]],\"NA\")","v":3}]
[null,null,"5.L Simplicity of the notification procedure",3,{"$f":"'Scoring criteria'!E78","v":2},"Section 5 (part 1) question 36, section 5 (part 2) question 16, 4 and 15 and Section 5 (part 3) question 7, 19 and 20",3,{"$f":"Tableau34[[#This Row],[Weigh]]*Tableau34[[#This Row],[Score]]","v":6},{"$f":"Tableau34[[#This Row],[Weigh]]*G165","v":9},{"$f":"IF(Tableau34[[#This Row],[Score]]<>\"NA\",Tableau34[[#This Row],[Maximum]]-Tableau34[[#This Row],[Priority (score + weigh)]],\"NA\")","v":3}]
[null,null,"5.F Simplicity of the case or threat definition",3,{"$f":"'Scoring criteria'!E72","v":2},"Section 5 (part 2 and 3)  question 1",3,{"$f":"Tableau34[[#This Row],[Weigh]]*Tableau34[[#This Row],[Score]]","v":6},{"$f":"Tableau34[[#This Row],[Weigh]]*G166","v":9},{"$f":"IF(Tableau34[[#This Row],[Score]]<>\"NA\",Tableau34[[#This Row],[Maximum]]-Tableau34[[#This Row],[Priority (score + weigh)]],\"NA\")","v":3}]
[null,null,"3.F Existence of coordination meetings at the intermediate level",2,{"$f":"'Scoring criteria'!E41","v":2},"Section 3 (part 1) question 18, 21, 28, 30 and 32",3,{"$f":"Tableau34[[#This Row],[Weigh]]*Tableau34[[#This Row],[Score]]","v":4},{"$f":"Tableau34[[#This Row],[Weigh]]*G167","v":6},{"$f":"IF(Tableau34[[#This Row],[Score]]<>\"NA\",Tableau34[[#This Row],[Maximum]]-Tableau34[[#This Row],[Priority (score + weigh)]],\"NA\")","v":2}]
[null,null,"2.E Frequency of meetings of the central coordinating body",2,{"$f":"'Scoring criteria'!E28","v":2},"Section 2 question 61, 62, 65 and 67",3,{"$f":"Tableau34[[#This Row],[Weigh]]*Tableau34[[#This Row],[Score]]","v":4},{"$f":"Tableau34[[#This Row],[Weigh]]*G168","v":6},{"$f":"IF(Tableau34[[#This Row],[Score]]<>\"NA\",Tableau34[[#This Row],[Maximum]]-Tableau34[[#This Row],[Priority (score + weigh)]],\"NA\")","v":2}]
[null,null,"5.M Simplicity of the data collection procedure",3,{"$f":"'Scoring criteria'!E79","v":2.5},"Section 5 (part 2) question 12, 17, 7, 8 and section 5 (part 3) question 16, 10, 14, 11, and 15",3,{"$f":"Tableau34[[#This Row],[Weigh]]*Tableau34[[#This Row],[Score]]","v":7.5},{"$f":"Tableau34[[#This Row],[Weigh]]*G169","v":9},{"$f":"IF(Tableau34[[#This Row],[Score]]<>\"NA\",Tableau34[[#This Row],[Maximum]]-Tableau34[[#This Row],[Priority (score + weigh)]],\"NA\")","v":1.5}]
[null,null,"9.B. Return of individual test results to field actors",3,{"$f":"'Scoring criteria'!E123","v":3},"Section 9 question 14",3,{"$f":"Tableau34[[#This Row],[Weigh]]*Tableau34[[#This Row],[Score]]","v":9},{"$f":"Tableau34[[#This Row],[Weigh]]*G170","v":9},{"$f":"IF(Tableau34[[#This Row],[Score]]<>\"NA\",Tableau34[[#This Row],[Maximum]]-Tableau34[[#This Row],[Priority (score + weigh)]],\"NA\")","v":0}]
[null,null,"9.D. Systematic return of reports on results to field actors (outside of a bulletin). ",3,{"$f":"'Scoring criteria'!E125","v":3},"Section 9 question 25 and 26",3,{"$f":"Tableau34[[#This Row],[Weigh]]*Tableau34[[#This Row],[Score]]","v":9},{"$f":"Tableau34[[#This Row],[Weigh]]*G171","v":9},{"$f":"IF(Tableau34[[#This Row],[Score]]<>\"NA\",Tableau34[[#This Row],[Maximum]]-Tableau34[[#This Row],[Priority (score + weigh)]],\"NA\")","v":0}]
[null,null,"7.A. Adequacy of the data management system for the needs of the system (relational database, etc.)",2,{"$f":"'Scoring criteria'!E100","v":3},"Section 7 question 3, 8 and 9 ",3,{"$f":"Tableau34[[#This Row],[Weigh]]*Tableau34[[#This Row],[Score]]","v":6},{"$f":"Tableau34[[#This Row],[Weigh]]*G172","v":6},{"$f":"IF(Tableau34[[#This Row],[Score]]<>\"NA\",Tableau34[[#This Row],[Maximum]]-Tableau34[[#This Row],[Priority (score + weigh)]],\"NA\")","v":0}]
[null,null,"3.B Active role of intermediary units in the functioning of the system (validation, management, feedback)",2,{"$f":"'Scoring criteria'!E37","v":3},"Section 3 (part 2) question 1",3,{"$f":"Tableau34[[#This Row],[Weigh]]*Tableau34[[#This Row],[Score]]","v":6},{"$f":"Tableau34[[#This Row],[Weigh]]*G173","v":6},{"$f":"IF(Tableau34[[#This Row],[Score]]<>\"NA\",Tableau34[[#This Row],[Maximum]]-Tableau34[[#This Row],[Priority (score + weigh)]],\"NA\")","v":0}]
[null,null,"4.A Effective integration of laboratories in the surveillance system",1,{"$f":"'Scoring criteria'!E49","v":3},"Section 4 question 1 and 2",3,{"$f":"Tableau34[[#This Row],[Weigh]]*Tableau34[[#This Row],[Score]]","v":3},{"$f":"Tableau34[[#This Row],[Weigh]]*G174","v":3},{"$f":"IF(Tableau34[[#This Row],[Score]]<>\"NA\",Tableau34[[#This Row],[Maximum]]-Tableau34[[#This Row],[Priority (score + weigh)]],\"NA\")","v":0}]
[null,null,"1.C           Taking partners’ expectations into account",3,{"$f":"'Scoring criteria'!E17","v":3},"Section 1 question 4",3,{"$f":"Tableau34[[#This Row],[Weigh]]*Tableau34[[#This Row],[Score]]","v":9},{"$f":"Tableau34[[#This Row],[Weigh]]*G175","v":9},{"$f":"IF(Tableau34[[#This Row],[Score]]<>\"NA\",Tableau34[[#This Row],[Maximum]]-Tableau34[[#This Row],[Priority (score + weigh)]],\"NA\")","v":0}]
[]
[]
[null,null,"Simplicity"]
[null,null,"Criteria","Weigh","Score","Referencing question ","Max","Priority (score + weigh)","Maximum","Missing points"]
[null,null,"2.A Existence of an operational management structure (central unit)",3,{"$f":"'Scoring criteria'!E24","v":0.5},"Section 2 question 7, 9, 10, 20 and 22",3,{"$f":"Tableau35[[#This Row],[Weigh]]*Tableau35[[#This Row],[Score]]","v":1.5},{"$f":"Tableau35[[#This Row],[Weigh]]*G180","v":9},{"$f":"IF(Tableau35[[#This Row],[Score]]<>\"NA\",Tableau35[[#This Row],[Maximum]]-Tableau35[[#This Row],[Priority (score + weigh)]],\"NA\")","v":7.5}]
[null,null,"8.B. Initial training implemented for all field agents when joining the system",3,{"$f":"'Scoring criteria'!E113","v":1},"Section 8 question 9 and 10",3,{"$f":"Tableau35[[#This Row],[Weigh]]*Tableau35[[#This Row],[Score]]","v":3},{"$f":"Tableau35[[#This Row],[Weigh]]*G181","v":9},{"$f":"IF(Tableau35[[#This Row],[Score]]<>\"NA\",Tableau35[[#This Row],[Maximum]]-Tableau35[[#This Row],[Priority (score + weigh)]],\"NA\")","v":6}]
[null,null,"4.K Technical level of data management at the laboratory",2,{"$f":"'Scoring criteria'!E59","v":1.5},"Section 4 question 15, 18 and 45",3,{"$f":"Tableau35[[#This Row],[Weigh]]*Tableau35[[#This Row],[Score]]","v":3},{"$f":"Tableau35[[#This Row],[Weigh]]*G182","v":6},{"$f":"IF(Tableau35[[#This Row],[Score]]<>\"NA\",Tableau35[[#This Row],[Maximum]]-Tableau35[[#This Row],[Priority (score + weigh)]],\"NA\")","v":3}]
[null,null,"5.L Simplicity of the notification procedure",3,{"$f":"'Scoring criteria'!E78","v":2},"Section 5 (part 1) question 36, section 5 (part 2) question 16, 4 and 15 and Section 5 (part 3) question 7, 19 and 20",3,{"$f":"Tableau35[[#This Row],[Weigh]]*Tableau35[[#This Row],[Score]]","v":6},{"$f":"Tableau35[[#This Row],[Weigh]]*G183","v":9},{"$f":"IF(Tableau35[[#This Row],[Score]]<>\"NA\",Tableau35[[#This Row],[Maximum]]-Tableau35[[#This Row],[Priority (score + weigh)]],\"NA\")","v":3}]
[null,null,"5.F Simplicity of the case or threat definition",3,{"$f":"'Scoring criteria'!E72","v":2},"Section 5 (part 2 and 3)  question 1",3,{"$f":"Tableau35[[#This Row],[Weigh]]*Tableau35[[#This Row],[Score]]","v":6},{"$f":"Tableau35[[#This Row],[Weigh]]*G184","v":9},{"$f":"IF(Tableau35[[#This Row],[Score]]<>\"NA\",Tableau35[[#This Row],[Maximum]]-Tableau35[[#This Row],[Priority (score + weigh)]],\"NA\")","v":3}]
[null,null,"5.M Simplicity of the data collection procedure",3,{"$f":"'Scoring criteria'!E79","v":2.5},"Section 5 (part 2) question 12, 17, 7, 8 and section 5 (part 3) question 16, 10, 14, 11, and 15",3,{"$f":"Tableau35[[#This Row],[Weigh]]*Tableau35[[#This Row],[Score]]","v":7.5},{"$f":"Tableau35[[#This Row],[Weigh]]*G185","v":9},{"$f":"IF(Tableau35[[#This Row],[Score]]<>\"NA\",Tableau35[[#This Row],[Maximum]]-Tableau35[[#This Row],[Priority (score + weigh)]],\"NA\")","v":1.5}]
[null,null,"7.A. Adequacy of the data management system for the needs of the system (relational database, etc.)",3,{"$f":"'Scoring criteria'!E100","v":3},"Section 7 question 3, 8 and 9 ",3,{"$f":"Tableau35[[#This Row],[Weigh]]*Tableau35[[#This Row],[Score]]","v":9},{"$f":"Tableau35[[#This Row],[Weigh]]*G186","v":9},{"$f":"IF(Tableau35[[#This Row],[Score]]<>\"NA\",Tableau35[[#This Row],[Maximum]]-Tableau35[[#This Row],[Priority (score + weigh)]],\"NA\")","v":0}]
[]
[]
[null,null,"Utility"]
[null,null,"Criteria","Weigh","Score","Referencing question","Max","Priority (score + weigh)","Maximum","Missing points"]
[null,null,"6.A Appropriateness of surveillance procedures with the system's objectives",3,{"$f":"'Scoring criteria'!E86","v":0},"Section 5 (part 1) question 50, 48 and 49",3,{"$f":"Tableau36[[#This Row],[Weigh]]*Tableau36[[#This Row],[Score]]","v":0},{"$f":"Tableau36[[#This Row],[Weigh]]*G191","v":9},{"$f":"IF(Tableau36[[#This Row],[Score]]<>\"NA\",Tableau36[[#This Row],[Maximum]]-Tableau36[[#This Row],[Priority (score + weigh)]],\"NA\")","v":9}]
[null,null,"7.G. Exploitation of data fits the needs of the system (if possible regular and multi-disciplinary)",3,{"$f":"'Scoring criteria'!E106","v":0},"Section 7 question 31, 33 and 34",3,{"$f":"Tableau36[[#This Row],[Weigh]]*Tableau36[[#This Row],[Score]]","v":0},{"$f":"Tableau36[[#This Row],[Weigh]]*G192","v":9},{"$f":"IF(Tableau36[[#This Row],[Score]]<>\"NA\",Tableau36[[#This Row],[Maximum]]-Tableau36[[#This Row],[Priority (score + weigh)]],\"NA\")","v":9}]
[null,null,"3.D Harmonization of intermediary units’ activities",2,{"$f":"'Scoring criteria'!E39","v":0},"section 3 (part 1) question 12, 13 and 14",3,{"$f":"Tableau36[[#This Row],[Weigh]]*Tableau36[[#This Row],[Score]]","v":0},{"$f":"Tableau36[[#This Row],[Weigh]]*G193","v":6},{"$f":"IF(Tableau36[[#This Row],[Score]]<>\"NA\",Tableau36[[#This Row],[Maximum]]-Tableau36[[#This Row],[Priority (score + weigh)]],\"NA\")","v":6}]
[null,null,"9.C. Regular dissemination of a relevant information bulletin",2,{"$f":"'Scoring criteria'!E124","v":1.5},"Section 9 question 33, 34, 35, 36 and 40",3,{"$f":"Tableau36[[#This Row],[Weigh]]*Tableau36[[#This Row],[Score]]","v":3},{"$f":"Tableau36[[#This Row],[Weigh]]*G194","v":6},{"$f":"IF(Tableau36[[#This Row],[Score]]<>\"NA\",Tableau36[[#This Row],[Maximum]]-Tableau36[[#This Row],[Priority (score + weigh)]],\"NA\")","v":3}]
[null,null,"2.D Organization and operations of the system laid down in regulations, a charter, or a convention established between the partners",1,{"$f":"'Scoring criteria'!E27","v":0},"Section 2 question 57, 58 and 59",3,{"$f":"Tableau36[[#This Row],[Weigh]]*Tableau36[[#This Row],[Score]]","v":0},{"$f":"Tableau36[[#This Row],[Weigh]]*G195","v":3},{"$f":"IF(Tableau36[[#This Row],[Score]]<>\"NA\",Tableau36[[#This Row],[Maximum]]-Tableau36[[#This Row],[Priority (score + weigh)]],\"NA\")","v":3}]
[null,null,"5.H Relevance of collected  samples",3,{"$f":"'Scoring criteria'!E74","v":2.5},"Section 5 (part 1) question 24, Section 5 (part 2) question 9 Section 5 (part 3) Quesstion 14 section 1 question 1 and 3",3,{"$f":"Tableau36[[#This Row],[Weigh]]*Tableau36[[#This Row],[Score]]","v":7.5},{"$f":"Tableau36[[#This Row],[Weigh]]*G196","v":9},{"$f":"IF(Tableau36[[#This Row],[Score]]<>\"NA\",Tableau36[[#This Row],[Maximum]]-Tableau36[[#This Row],[Priority (score + weigh)]],\"NA\")","v":1.5}]
[null,null,"1.A           Relevance of surveillance objectives",3,{"$f":"'Scoring criteria'!E15","v":3},"Section 1 question 1 and 3",3,{"$f":"Tableau36[[#This Row],[Weigh]]*Tableau36[[#This Row],[Score]]","v":9},{"$f":"Tableau36[[#This Row],[Weigh]]*G197","v":9},{"$f":"IF(Tableau36[[#This Row],[Score]]<>\"NA\",Tableau36[[#This Row],[Maximum]]-Tableau36[[#This Row],[Priority (score + weigh)]],\"NA\")","v":0}]
[null,null,"9.D. Systematic return of reports on results to field actors (outside of a bulletin). ",3,{"$f":"'Scoring criteria'!E125","v":3},"Section 9 question 25 and 26",3,{"$f":"Tableau36[[#This Row],[Weigh]]*Tableau36[[#This Row],[Score]]","v":9},{"$f":"Tableau36[[#This Row],[Weigh]]*G198","v":9},{"$f":"IF(Tableau36[[#This Row],[Score]]<>\"NA\",Tableau36[[#This Row],[Maximum]]-Tableau36[[#This Row],[Priority (score + weigh)]],\"NA\")","v":0}]
[null,null,"1.D           Coherence of the diseases under surveillance with the sanitary situation (existing/exotic diseases or threats)",3,{"$f":"'Scoring criteria'!E18","v":3},"Section 1 question 3",3,{"$f":"Tableau36[[#This Row],[Weigh]]*Tableau36[[#This Row],[Score]]","v":9},{"$f":"Tableau36[[#This Row],[Weigh]]*G199","v":9},{"$f":"IF(Tableau36[[#This Row],[Score]]<>\"NA\",Tableau36[[#This Row],[Maximum]]-Tableau36[[#This Row],[Priority (score + weigh)]],\"NA\")","v":0}]
[null,null,"7.A. Adequacy of the data management system for the needs of the system (relational database, etc.)",3,{"$f":"'Scoring criteria'!E100","v":3},"Section 7 question 3, 8 and 9 ",3,{"$f":"Tableau36[[#This Row],[Weigh]]*Tableau36[[#This Row],[Score]]","v":9},{"$f":"Tableau36[[#This Row],[Weigh]]*G200","v":9},{"$f":"IF(Tableau36[[#This Row],[Score]]<>\"NA\",Tableau36[[#This Row],[Maximum]]-Tableau36[[#This Row],[Priority (score + weigh)]],\"NA\")","v":0}]
[null,null,"9.F. Solid external communication policy",2,{"$f":"'Scoring criteria'!E127","v":3},"Section 9 question 24 and 32",3,{"$f":"Tableau36[[#This Row],[Weigh]]*Tableau36[[#This Row],[Score]]","v":6},{"$f":"Tableau36[[#This Row],[Weigh]]*G201","v":6},{"$f":"IF(Tableau36[[#This Row],[Score]]<>\"NA\",Tableau36[[#This Row],[Maximum]]-Tableau36[[#This Row],[Priority (score + weigh)]],\"NA\")","v":0}]
[null,null,"1.C           Taking partners’ expectations into account",3,{"$f":"'Scoring criteria'!E17","v":3},"Section 1 question 4",3,{"$f":"Tableau36[[#This Row],[Weigh]]*Tableau36[[#This Row],[Score]]","v":9},{"$f":"Tableau36[[#This Row],[Weigh]]*G202","v":9},{"$f":"IF(Tableau36[[#This Row],[Score]]<>\"NA\",Tableau36[[#This Row],[Maximum]]-Tableau36[[#This Row],[Priority (score + weigh)]],\"NA\")","v":0}]
[null,null,"7.F Complete descriptive processing of data",1,{"$f":"'Scoring criteria'!E105","v":3},"Section 7 question 36, 37, 38, 40 and 49",3,{"$f":"Tableau36[[#This Row],[Weigh]]*Tableau36[[#This Row],[Score]]","v":3},{"$f":"Tableau36[[#This Row],[Weigh]]*G203","v":3},{"$f":"IF(Tableau36[[#This Row],[Score]]<>\"NA\",Tableau36[[#This Row],[Maximum]]-Tableau36[[#This Row],[Priority (score + weigh)]],\"NA\")","v":0}]

{"sheet":"Calculation output 2","index":8,"n_rows":53,"n_cols":26,"rows_kept":53,"cut":false,"hidden":true,"merged":[]}
["OASIS"]
["Calculs sortie 2"]
[]
["Maladies présentes",{"$nulls":6},"date + 6 months",{"$nulls":4},"date + 1 year",{"$nulls":4},"date + 2 year"]
[]
[null,"Note","Complément","Dénominateur",{"$nulls":4},"Note","Complément","Dénominateur",null,null,"Note","Complément","Dénominateur",null,null,"Note","Complément","Dénominateur"]
["Objectives\n(max 15)",{"$f":"'Calculation sheet'!H3","v":12},{"$f":"D7-B7","v":3},15,{"$f":"B7/D7","v":0.8},null,null,"Objectives\n(max 15)",{"$f":"'financial sheet'!K4","v":12},{"$f":"K7-I7","v":3},15,{"$f":"I7/K7","v":0.8},"Objectives\n(max 15)",{"$f":"'financial sheet'!L4","v":12},{"$f":"P7-N7","v":3},15,{"$f":"N7/P7","v":0.8},"Objectives\n(max 15)",{"$f":"'financial sheet'!M4","v":12},{"$f":"U7-S7","v":3},15,{"$f":"S7/U7","v":0.8}]
[null,{"$f":"B7","v":12},{"$f":"C7","v":3},{"$f":"D7","v":15},{"$f":"E7","v":0.8},null,null,null,{"$f":"I7","v":12},{"$f":"J7","v":3},{"$f":"K7","v":15},{"$f":"L7","v":0.8},null,{"$f":"N7","v":12},{"$f":"O7","v":3},{"$f":"P7","v":15},{"$f":"Q7","v":0.8},null,{"$f":"S7","v":12},{"$f":"T7","v":3},{"$f":"U7","v":15},{"$f":"V7","v":0.8}]
[null,{"$f":"B7","v":12},{"$f":"C7","v":3},{"$f":"D7","v":15},{"$f":"E7","v":0.8},null,null,null,{"$f":"I7","v":12},{"$f":"J7","v":3},{"$f":"K7","v":15},{"$f":"L7","v":0.8},null,{"$f":"N7","v":12},{"$f":"O7","v":3},{"$f":"P7","v":15},{"$f":"Q7","v":0.8},null,{"$f":"S7","v":12},{"$f":"T7","v":3},{"$f":"U7","v":15},{"$f":"V7","v":0.8}]
[null,{"$f":"B11","v":7.5694444444444446},{"$f":"C11","v":12.430555555555555},{"$f":"D11","v":20},{"$f":"E11","v":0.37847222222222221},null,null,null,{"$f":"I11","v":10.5},{"$f":"J11","v":9.5},{"$f":"K11","v":20},{"$f":"L11","v":0.52500000000000002},null,{"$f":"N11","v":10.5},{"$f":"O11","v":9.5},{"$f":"P11","v":20},{"$f":"Q11","v":0.52500000000000002},null,{"$f":"S11","v":10.5},{"$f":"T11","v":9.5},{"$f":"U11","v":20},{"$f":"V11","v":0.52500000000000002}]
["Sampling\n(max 20)",{"$f":"'Calculation sheet'!J3","v":7.5694444444444446},{"$f":"D11-B11","v":12.430555555555555},20,{"$f":"B11/D11","v":0.37847222222222221},null,null,"Sampling\n(max 20)",{"$f":"'financial sheet'!O4","v":10.5},{"$f":"K11-I11","v":9.5},20,{"$f":"I11/K11","v":0.52500000000000002},"Sampling\n(max 20)",{"$f":"'financial sheet'!P4","v":10.5},{"$f":"P11-N11","v":9.5},20,{"$f":"N11/P11","v":0.52500000000000002},"Sampling\n(max 20)",{"$f":"'financial sheet'!Q4","v":10.5},{"$f":"U11-S11","v":9.5},20,{"$f":"S11/U11","v":0.52500000000000002}]
[null,{"$f":"B11","v":7.5694444444444446},{"$f":"C11","v":12.430555555555555},{"$f":"D11","v":20},{"$f":"E11","v":0.37847222222222221},null,null,null,{"$f":"I11","v":10.5},{"$f":"J11","v":9.5},{"$f":"K11","v":20},{"$f":"L11","v":0.52500000000000002},null,{"$f":"N11","v":10.5},{"$f":"O11","v":9.5},{"$f":"P11","v":20},{"$f":"Q11","v":0.52500000000000002},null,{"$f":"S11","v":10.5},{"$f":"T11","v":9.5},{"$f":"U11","v":20},{"$f":"V11","v":0.52500000000000002}]
[null,{"$f":"B11","v":7.5694444444444446},{"$f":"C11","v":12.430555555555555},{"$f":"D11","v":20},{"$f":"E11","v":0.37847222222222221},null,null,null,{"$f":"I11","v":10.5},{"$f":"J11","v":9.5},{"$f":"K11","v":20},{"$f":"L11","v":0.52500000000000002},null,{"$f":"N11","v":10.5},{"$f":"O11","v":9.5},{"$f":"P11","v":20},{"$f":"Q11","v":0.52500000000000002},null,{"$f":"S11","v":10.5},{"$f":"T11","v":9.5},{"$f":"U11","v":20},{"$f":"V11","v":0.52500000000000002}]
[null,{"$f":"B15","v":8.0090909090909097},{"$f":"C15","v":6.9909090909090903},{"$f":"D15","v":15},{"$f":"E15","v":0.53393939393939394},null,null,null,{"$f":"I15","v":8.0090909090909097},{"$f":"J15","v":6.9909090909090903},{"$f":"K15","v":15},{"$f":"L15","v":0.53393939393939394},null,{"$f":"N15","v":8.0090909090909097},{"$f":"O15","v":6.9909090909090903},{"$f":"P15","v":15},{"$f":"Q15","v":0.53393939393939394},null,{"$f":"S15","v":8.0090909090909097},{"$f":"T15","v":6.9909090909090903},{"$f":"U15","v":15},{"$f":"V15","v":0.53393939393939394}]
["Animation\n(max 15)",{"$f":"'Calculation sheet'!V3","v":8.0090909090909097},{"$f":"D15-B15","v":6.9909090909090903},15,{"$f":"B15/D15","v":0.53393939393939394},null,null,"Animation\n(max 15)",{"$f":"'financial sheet'!AM4","v":8.0090909090909097},{"$f":"K15-I15","v":6.9909090909090903},15,{"$f":"I15/K15","v":0.53393939393939394},"Animation\n(max 15)",{"$f":"'financial sheet'!AN4","v":8.0090909090909097},{"$f":"P15-N15","v":6.9909090909090903},15,{"$f":"N15/P15","v":0.53393939393939394},"Animation\n(max 15)",{"$f":"'financial sheet'!AO4","v":8.0090909090909097},{"$f":"U15-S15","v":6.9909090909090903},15,{"$f":"S15/U15","v":0.53393939393939394}]
[null,{"$f":"B15","v":8.0090909090909097},{"$f":"C15","v":6.9909090909090903},{"$f":"D15","v":15},{"$f":"E15","v":0.53393939393939394},null,null,null,{"$f":"I15","v":8.0090909090909097},{"$f":"J15","v":6.9909090909090903},{"$f":"K15","v":15},{"$f":"L15","v":0.53393939393939394},null,{"$f":"N15","v":8.0090909090909097},{"$f":"O15","v":6.9909090909090903},{"$f":"P15","v":15},{"$f":"Q15","v":0.53393939393939394},null,{"$f":"S15","v":8.0090909090909097},{"$f":"T15","v":6.9909090909090903},{"$f":"U15","v":15},{"$f":"V15","v":0.53393939393939394}]
[null,{"$f":"B18","v":16.333333333333332},{"$f":"C18","v":3.6666666666666679},{"$f":"D18","v":20},{"$f":"E18","v":0.81666666666666665},null,null,null,{"$f":"I18","v":16.333333333333332},{"$f":"J18","v":3.6666666666666679},{"$f":"K18","v":20},{"$f":"L18","v":0.81666666666666665},null,{"$f":"N18","v":16.333333333333332},{"$f":"O18","v":3.6666666666666679},{"$f":"P18","v":20},{"$f":"Q18","v":0.81666666666666665},null,{"$f":"S18","v":16.333333333333332},{"$f":"T18","v":3.6666666666666679},{"$f":"U18","v":20},{"$f":"V18","v":0.81666666666666665}]
["       Tools\n      (max 20)",{"$f":"'Calculation sheet'!AJ3","v":16.333333333333332},{"$f":"D18-B18","v":3.6666666666666679},20,{"$f":"B18/D18","v":0.81666666666666665},null,null,"       Tools\n      (max 20)",{"$f":"'financial sheet'!BO4","v":16.333333333333332},{"$f":"K18-I18","v":3.6666666666666679},20,{"$f":"I18/K18","v":0.81666666666666665},"       Tools\n      (max 20)",{"$f":"'financial sheet'!BP4","v":16.333333333333332},{"$f":"P18-N18","v":3.6666666666666679},20,{"$f":"N18/P18","v":0.81666666666666665},"       Tools\n      (max 20)",{"$f":"'financial sheet'!BQ4","v":16.333333333333332},{"$f":"U18-S18","v":3.6666666666666679},20,{"$f":"S18/U18","v":0.81666666666666665}]
[null,{"$f":"B18","v":16.333333333333332},{"$f":"C18","v":3.6666666666666679},{"$f":"D18","v":20},{"$f":"E18","v":0.81666666666666665},null,null,null,{"$f":"I18","v":16.333333333333332},{"$f":"J18","v":3.6666666666666679},{"$f":"K18","v":20},{"$f":"L18","v":0.81666666666666665},null,{"$f":"N18","v":16.333333333333332},{"$f":"O18","v":3.6666666666666679},{"$f":"P18","v":20},{"$f":"Q18","v":0.81666666666666665},null,{"$f":"S18","v":16.333333333333332},{"$f":"T18","v":3.6666666666666679},{"$f":"U18","v":20},{"$f":"V18","v":0.81666666666666665}]
[null,{"$f":"B18","v":16.333333333333332},{"$f":"C18","v":3.6666666666666679},{"$f":"D18","v":20},{"$f":"E18","v":0.81666666666666665},null,null,null,{"$f":"I18","v":16.333333333333332},{"$f":"J18","v":3.6666666666666679},{"$f":"K18","v":20},{"$f":"L18","v":0.81666666666666665},null,{"$f":"N18","v":16.333333333333332},{"$f":"O18","v":3.6666666666666679},{"$f":"P18","v":20},{"$f":"Q18","v":0.81666666666666665},null,{"$f":"S18","v":16.333333333333332},{"$f":"T18","v":3.6666666666666679},{"$f":"U18","v":20},{"$f":"V18","v":0.81666666666666665}]
["       Collection, circulation\n       (max 10)",{"$f":"'Calculation sheet'!AT3","v":5.1190476190476186},{"$f":"D21-B21","v":4.8809523809523814},10,{"$f":"B21/D21","v":0.51190476190476186},null,null,"       Collection, circulation\n       (max 10)",{"$f":"'financial sheet'!CI4","v":5.1190476190476186},{"$f":"K21-I21","v":4.8809523809523814},10,{"$f":"I21/K21","v":0.51190476190476186},"       Collection, circulation\n       (max 10)",{"$f":"'financial sheet'!CJ4","v":5.1190476190476186},{"$f":"P21-N21","v":4.8809523809523814},10,{"$f":"N21/P21","v":0.51190476190476186},"       Collection, circulation\n       (max 10)",{"$f":"'financial sheet'!CK4","v":5.1190476190476186},{"$f":"U21-S21","v":4.8809523809523814},10,{"$f":"S21/U21","v":0.51190476190476186}]
[null,{"$f":"B21","v":5.1190476190476186},{"$f":"C21","v":4.8809523809523814},{"$f":"D21","v":10},{"$f":"E21","v":0.51190476190476186},null,null,null,{"$f":"I21","v":5.1190476190476186},{"$f":"J21","v":4.8809523809523814},{"$f":"K21","v":10},{"$f":"L21","v":0.51190476190476186},null,{"$f":"N21","v":5.1190476190476186},{"$f":"O21","v":4.8809523809523814},{"$f":"P21","v":10},{"$f":"Q21","v":0.51190476190476186},null,{"$f":"S21","v":5.1190476190476186},{"$f":"T21","v":4.8809523809523814},{"$f":"U21","v":10},{"$f":"V21","v":0.51190476190476186}]
["       Processing, interpretation\n       (max 10)",{"$f":"'Calculation sheet'!AX3","v":3.8541666666666665},{"$f":"D23-B23","v":6.1458333333333339},10,{"$f":"B23/D23","v":0.38541666666666663},null,null,"       Processing, interpretation\n       (max 10)",{"$f":"'financial sheet'!CQ4","v":3.8541666666666665},{"$f":"K23-I23","v":6.1458333333333339},10,{"$f":"I23/K23","v":0.38541666666666663},"       Processing, interpretation\n       (max 10)",{"$f":"'financial sheet'!CR4","v":3.8541666666666665},{"$f":"P23-N23","v":6.1458333333333339},10,{"$f":"N23/P23","v":0.38541666666666663},"       Processing, interpretation\n       (max 10)",{"$f":"'financial sheet'!CS4","v":3.8541666666666665},{"$f":"U23-S23","v":6.1458333333333339},10,{"$f":"S23/U23","v":0.38541666666666663}]
[null,{"$f":"B23","v":3.8541666666666665},{"$f":"C23","v":6.1458333333333339},{"$f":"D23","v":10},{"$f":"E23","v":0.38541666666666663},null,null,null,{"$f":"I23","v":3.8541666666666665},{"$f":"J23","v":6.1458333333333339},{"$f":"K23","v":10},{"$f":"L23","v":0.38541666666666663},null,{"$f":"N23","v":3.8541666666666665},{"$f":"O23","v":6.1458333333333339},{"$f":"P23","v":10},{"$f":"Q23","v":0.38541666666666663},null,{"$f":"S23","v":3.8541666666666665},{"$f":"T23","v":6.1458333333333339},{"$f":"U23","v":10},{"$f":"V23","v":0.38541666666666663}]
["      Info dissemination\n       (max 10)",{"$f":"B26","v":4.375},{"$f":"C26","v":5.625},{"$f":"D26","v":10},{"$f":"E26","v":0.4375},null,null,"      Info dissemination\n       (max 10)",{"$f":"I26","v":4.375},{"$f":"J26","v":5.625},{"$f":"K26","v":10},{"$f":"L26","v":0.4375},"      Info dissemination\n       (max 10)",{"$f":"N26","v":4.375},{"$f":"O26","v":5.625},{"$f":"P26","v":10},{"$f":"Q26","v":0.4375},"      Info dissemination\n       (max 10)",{"$f":"S26","v":4.375},{"$f":"T26","v":5.625},{"$f":"U26","v":10},{"$f":"V26","v":0.4375}]
[null,{"$f":"'Calculation sheet'!BB3","v":4.375},{"$f":"D26-B26","v":5.625},10,{"$f":"B26/D26","v":0.4375},null,null,null,{"$f":"'financial sheet'!CY4","v":4.375},{"$f":"K26-I26","v":5.625},10,{"$f":"I26/K26","v":0.4375},null,{"$f":"'financial sheet'!CZ4","v":4.375},{"$f":"P26-N26","v":5.625},10,{"$f":"N26/P26","v":0.4375},null,{"$f":"'financial sheet'!DA4","v":4.375},{"$f":"U26-S26","v":5.625},10,{"$f":"S26/U26","v":0.4375}]
[null,null,null,{"$f":"SUM(D7:D26)","v":310},{"$nulls":6},{"$f":"SUM(K7:K26)","v":310},{"$nulls":4},{"$f":"SUM(P7:P26)","v":310},{"$nulls":4},{"$f":"SUM(U7:U26)","v":310}]
[]
["Maladies exotiques"]
[{"$nulls":7},"date + 6 months",{"$nulls":5},"date + 1 year",{"$nulls":5},"date + 2 year"]
[null,"Note","Complément","Dénominateur",null,"Note",null,null,"Note","Complément","Dénominateur",null,"Note",null,"Note","Complément","Dénominateur",null,"Note",null,"Note","Complément","Dénominateur",null,"Note","Note"]
["Objectives\n(sur 15)",{"$f":"'Calculation sheet'!H3","v":12},{"$f":"D32-B32","v":3},15,{"$f":"B32/D32","v":0.8},{"$f":"B32","v":12},null,"Objectives\n(sur 15)",{"$f":"'financial sheet'!K4","v":12},{"$f":"K32-I32","v":3},15,{"$f":"I32/K32","v":0.8},{"$f":"I32","v":12},"Objectives\n(sur 15)",{"$f":"'financial sheet'!L4","v":12},{"$f":"Q32-O32","v":3},15,{"$f":"O32/Q32","v":0.8},{"$f":"O32","v":12},"Objectives\n(sur 15)",{"$f":"'financial sheet'!M4","v":12},{"$f":"W32-U32","v":3},15,{"$f":"U32/W32","v":0.8},{"$f":"U32","v":12},{"$f":"V32","v":3}]
[null,{"$f":"B32","v":12},{"$f":"C32","v":3},{"$f":"D32","v":15},{"$f":"E32","v":0.8},{"$f":"F32","v":12},null,null,{"$f":"I32","v":12},{"$f":"J32","v":3},{"$f":"K32","v":15},{"$f":"L32","v":0.8},{"$f":"M32","v":12},null,{"$f":"O32","v":12},{"$f":"P32","v":3},{"$f":"Q32","v":15},{"$f":"R32","v":0.8},{"$f":"S32","v":12},null,{"$f":"U32","v":12},3,15,0.8,12,3]
[null,{"$f":"B32","v":12},{"$f":"C32","v":3},{"$f":"D32","v":15},{"$f":"E32","v":0.8},{"$f":"F32","v":12},null,null,{"$f":"I32","v":12},{"$f":"J32","v":3},{"$f":"K32","v":15},{"$f":"L32","v":0.8},{"$f":"M32","v":12},null,{"$f":"O32","v":12},{"$f":"P32","v":3},{"$f":"Q32","v":15},{"$f":"R32","v":0.8},{"$f":"S32","v":12},null,{"$f":"U32","v":12},3,15,0.8,12,3]
[null,{"$f":"B36","v":9.7222222222222232},{"$f":"C36","v":10.277777777777777},{"$f":"D36","v":20},{"$f":"E36","v":0.48611111111111116},{"$f":"F36","v":9.7222222222222232},null,null,{"$f":"I36","v":10.5},{"$f":"J36","v":9.5},{"$f":"K36","v":20},{"$f":"L36","v":0.52500000000000002},{"$f":"M36","v":10.5},null,{"$f":"O36","v":10.5},{"$f":"P36","v":9.5},{"$f":"Q36","v":20},{"$f":"R36","v":0.52500000000000002},{"$f":"S36","v":10.5},null,{"$f":"U36","v":10.5},9.5,20,0.52500000000000002,10.5,9.5]
["Sampling\n(sur 20)",{"$f":"'Calculation sheet'!L3","v":9.7222222222222232},{"$f":"D36-B36","v":10.277777777777777},20,{"$f":"B36/D36","v":0.48611111111111116},{"$f":"B36","v":9.7222222222222232},null,"Sampling\n(sur 20)",{"$f":"'financial sheet'!S4","v":10.5},{"$f":"K36-I36","v":9.5},20,{"$f":"I36/K36","v":0.52500000000000002},{"$f":"I36","v":10.5},"Sampling\n(sur 20)",{"$f":"'financial sheet'!T4","v":10.5},{"$f":"Q36-O36","v":9.5},20,{"$f":"O36/Q36","v":0.52500000000000002},{"$f":"O36","v":10.5},"Sampling\n(sur 20)",{"$f":"'financial sheet'!U4","v":10.5},{"$f":"W36-U36","v":9.5},20,{"$f":"U36/W36","v":0.52500000000000002},{"$f":"U36","v":10.5},{"$f":"V36","v":9.5}]
[null,{"$f":"B36","v":9.7222222222222232},{"$f":"C36","v":10.277777777777777},{"$f":"D36","v":20},{"$f":"E36","v":0.48611111111111116},{"$f":"F36","v":9.7222222222222232},null,null,{"$f":"I36","v":10.5},{"$f":"J36","v":9.5},{"$f":"K36","v":20},{"$f":"L36","v":0.52500000000000002},{"$f":"M36","v":10.5},null,{"$f":"O36","v":10.5},{"$f":"P36","v":9.5},{"$f":"Q36","v":20},{"$f":"R36","v":0.52500000000000002},{"$f":"S36","v":10.5},null,{"$f":"U36","v":10.5},9.5,20,0.52500000000000002,10.5,9.5]
[null,{"$f":"B36","v":9.7222222222222232},{"$f":"C36","v":10.277777777777777},{"$f":"D36","v":20},{"$f":"E36","v":0.48611111111111116},{"$f":"F36","v":9.7222222222222232},null,null,{"$f":"I36","v":10.5},{"$f":"J36","v":9.5},{"$f":"K36","v":20},{"$f":"L36","v":0.52500000000000002},{"$f":"M36","v":10.5},null,{"$f":"O36","v":10.5},{"$f":"P36","v":9.5},{"$f":"Q36","v":20},{"$f":"R36","v":0.52500000000000002},{"$f":"S36","v":10.5},null,{"$f":"U36","v":10.5},9.5,20,0.52500000000000002,10.5,9.5]
[null,{"$f":"B40","v":8.5636363636363644},{"$f":"C40","v":6.4363636363636356},{"$f":"D40","v":15},{"$f":"E40","v":0.57090909090909092},{"$f":"F40","v":8.5636363636363644},null,null,{"$f":"I40","v":8.5636363636363644},{"$f":"J40","v":6.4363636363636356},{"$f":"K40","v":15},{"$f":"L40","v":0.57090909090909092},{"$f":"M40","v":8.5636363636363644},null,{"$f":"O40","v":8.5636363636363644},{"$f":"P40","v":6.4363636363636356},{"$f":"Q40","v":15},{"$f":"R40","v":0.57090909090909092},{"$f":"S40","v":8.5636363636363644},null,{"$f":"U40","v":8.5636363636363644},6.4363636363636356,15,0.57090909090909092,8.5636363636363644,6.4363636363636356]
["Animation\n(sur 15)",{"$f":"'Calculation sheet'!X3","v":8.5636363636363644},{"$f":"D40-B40","v":6.4363636363636356},15,{"$f":"B40/D40","v":0.57090909090909092},{"$f":"B40","v":8.5636363636363644},null,"Animation\n(sur 15)",{"$f":"'financial sheet'!AQ4","v":8.5636363636363644},{"$f":"K40-I40","v":6.4363636363636356},15,{"$f":"I40/K40","v":0.57090909090909092},{"$f":"I40","v":8.5636363636363644},"Animation\n(sur 15)",{"$f":"'financial sheet'!AR4","v":8.5636363636363644},{"$f":"Q40-O40","v":6.4363636363636356},15,{"$f":"O40/Q40","v":0.57090909090909092},{"$f":"O40","v":8.5636363636363644},"Animation\n(sur 15)",{"$f":"'financial sheet'!AS4","v":8.5636363636363644},{"$f":"W40-U40","v":6.4363636363636356},15,{"$f":"U40/W40","v":0.57090909090909092},{"$f":"U40","v":8.5636363636363644},{"$f":"V40","v":6.4363636363636356}]
[null,{"$f":"B40","v":8.5636363636363644},{"$f":"C40","v":6.4363636363636356},{"$f":"D40","v":15},{"$f":"E40","v":0.57090909090909092},{"$f":"F40","v":8.5636363636363644},null,null,{"$f":"I40","v":8.5636363636363644},{"$f":"J40","v":6.4363636363636356},{"$f":"K40","v":15},{"$f":"L40","v":0.57090909090909092},{"$f":"M40","v":8.5636363636363644},null,{"$f":"O40","v":8.5636363636363644},{"$f":"P40","v":6.4363636363636356},{"$f":"Q40","v":15},{"$f":"R40","v":0.57090909090909092},{"$f":"S40","v":8.5636363636363644},null,{"$f":"U40","v":8.5636363636363644},6.4363636363636356,15,0.57090909090909092,8.5636363636363644,6.4363636363636356]
["Environment \n(sur 4)",{"$f":"'Calculation sheet'!AF4","v":0},{"$f":"D42-B42","v":4},4,{"$f":"B42/D42","v":0},{"$f":"IF('[1]Calculation sheet'!AH3=0,\"SO\",'[1]Calculation output 2'!B42)","v":0.66666666666666663},null,"Environment \n(sur 4)",{"$f":"'financial sheet'!BG5","v":0},{"$f":"K42-I42","v":4},4,{"$f":"I42/K42","v":0},{"$f":"IF('[1]financial sheet'!BK4=0,\"SO\",'[1]Calculation output 2'!I42)","v":0.66666666666666663},"Environment \n(sur 4)",{"$f":"'financial sheet'!BH5","v":0},{"$f":"Q42-O42","v":4},4,{"$f":"O42/Q42","v":0},{"$f":"IF('[1]financial sheet'!BQ4=0,\"SO\",'[1]Calculation output 2'!O42)","v":0.66666666666666663},"Environment \n(sur 4)",{"$f":"'financial sheet'!BI5","v":0},{"$f":"W42-U42","v":4},4,{"$f":"U42/W42","v":0},{"$f":"IF('[1]financial sheet'!BW4=0,\"SO\",'[1]Calculation output 2'!U42)","v":"SO"},{"$f":"IF('Calculation sheet'!AH3=0,\"SO\",'Calculation output 2'!V42)","v":4}]
[null,{"$f":"B44","v":16.333333333333332},{"$f":"C44","v":3.6666666666666679},{"$f":"D44","v":20},{"$f":"E44","v":0.81666666666666665},{"$f":"F44","v":16.333333333333332},null,null,{"$f":"I44","v":16.333333333333332},{"$f":"J44","v":3.6666666666666679},{"$f":"K44","v":20},{"$f":"L44","v":0.81666666666666665},{"$f":"M44","v":16.333333333333332},null,{"$f":"O44","v":16.333333333333332},{"$f":"P44","v":3.6666666666666679},{"$f":"Q44","v":20},{"$f":"R44","v":0.81666666666666665},{"$f":"S44","v":16.333333333333332},null,{"$f":"U44","v":16.333333333333332},3.6666666666666679,20,0.81666666666666665,16.333333333333332,3.6666666666666679]
["       Tools\n       (sur 20)",{"$f":"'Calculation sheet'!AJ3","v":16.333333333333332},{"$f":"D44-B44","v":3.6666666666666679},20,{"$f":"B44/D44","v":0.81666666666666665},{"$f":"B44","v":16.333333333333332},null,"       Tools\n       (sur 20)",{"$f":"'financial sheet'!BO4","v":16.333333333333332},{"$f":"K44-I44","v":3.6666666666666679},20,{"$f":"I44/K44","v":0.81666666666666665},{"$f":"I44","v":16.333333333333332},"       Tools\n       (sur 20)",{"$f":"'financial sheet'!BP4","v":16.333333333333332},{"$f":"Q44-O44","v":3.6666666666666679},20,{"$f":"O44/Q44","v":0.81666666666666665},{"$f":"O44","v":16.333333333333332},"       Tools\n       (sur 20)",{"$f":"'financial sheet'!BQ4","v":16.333333333333332},{"$f":"W44-U44","v":3.6666666666666679},20,{"$f":"U44/W44","v":0.81666666666666665},{"$f":"U44","v":16.333333333333332},{"$f":"V44","v":3.6666666666666679}]
[null,{"$f":"B44","v":16.333333333333332},{"$f":"C44","v":3.6666666666666679},{"$f":"D44","v":20},{"$f":"E44","v":0.81666666666666665},{"$f":"F44","v":16.333333333333332},null,null,{"$f":"I44","v":16.333333333333332},{"$f":"J44","v":3.6666666666666679},{"$f":"K44","v":20},{"$f":"L44","v":0.81666666666666665},{"$f":"M44","v":16.333333333333332},null,{"$f":"O44","v":16.333333333333332},{"$f":"P44","v":3.6666666666666679},{"$f":"Q44","v":20},{"$f":"R44","v":0.81666666666666665},{"$f":"S44","v":16.333333333333332},null,{"$f":"U44","v":16.333333333333332},3.6666666666666679,20,0.81666666666666665,16.333333333333332,3.6666666666666679]
[null,{"$f":"B44","v":16.333333333333332},{"$f":"C44","v":3.6666666666666679},{"$f":"D44","v":20},{"$f":"E44","v":0.81666666666666665},{"$f":"F44","v":16.333333333333332},null,null,{"$f":"I44","v":16.333333333333332},{"$f":"J44","v":3.6666666666666679},{"$f":"K44","v":20},{"$f":"L44","v":0.81666666666666665},{"$f":"M44","v":16.333333333333332},null,{"$f":"O44","v":16.333333333333332},{"$f":"P44","v":3.6666666666666679},{"$f":"Q44","v":20},{"$f":"R44","v":0.81666666666666665},{"$f":"S44","v":16.333333333333332},null,{"$f":"U44","v":16.333333333333332},3.6666666666666679,20,0.81666666666666665,16.333333333333332,3.6666666666666679]
["        Collection & circulation\n        (sur 10)",{"$f":"'Calculation sheet'!AT3","v":5.1190476190476186},{"$f":"D47-B47","v":4.8809523809523814},10,{"$f":"B47/D47","v":0.51190476190476186},{"$f":"B47","v":5.1190476190476186},null,"        Collection & circulation\n        (sur 10)",{"$f":"'financial sheet'!CI4","v":5.1190476190476186},{"$f":"K47-I47","v":4.8809523809523814},10,{"$f":"I47/K47","v":0.51190476190476186},{"$f":"I47","v":5.1190476190476186},"        Collection & circulation\n        (sur 10)",{"$f":"'financial sheet'!CJ4","v":5.1190476190476186},{"$f":"Q47-O47","v":4.8809523809523814},10,{"$f":"O47/Q47","v":0.51190476190476186},{"$f":"O47","v":5.1190476190476186},"        Collection & circulation\n        (sur 10)",{"$f":"'financial sheet'!CK4","v":5.1190476190476186},{"$f":"W47-U47","v":4.8809523809523814},10,{"$f":"U47/W47","v":0.51190476190476186},{"$f":"U47","v":5.1190476190476186},{"$f":"V47","v":4.8809523809523814}]
[null,{"$f":"B47","v":5.1190476190476186},{"$f":"C47","v":4.8809523809523814},{"$f":"D47","v":10},{"$f":"E47","v":0.51190476190476186},{"$f":"F47","v":5.1190476190476186},null,null,{"$f":"I47","v":5.1190476190476186},{"$f":"J47","v":4.8809523809523814},{"$f":"K47","v":10},{"$f":"L47","v":0.51190476190476186},{"$f":"M47","v":5.1190476190476186},null,{"$f":"O47","v":5.1190476190476186},{"$f":"P47","v":4.8809523809523814},{"$f":"Q47","v":10},{"$f":"R47","v":0.51190476190476186},{"$f":"S47","v":5.1190476190476186},null,{"$f":"U47","v":5.1190476190476186},4.8809523809523814,10,0.51190476190476186,5.1190476190476186,4.8809523809523814]
[" Processing, interpretation\n        (sur 10)",{"$f":"'Calculation sheet'!AX3","v":3.8541666666666665},{"$f":"D49-B49","v":6.1458333333333339},10,{"$f":"B49/D49","v":0.38541666666666663},{"$f":"B49","v":3.8541666666666665},null," Processing, interpretation\n        (sur 10)",{"$f":"'financial sheet'!CQ4","v":3.8541666666666665},{"$f":"K49-I49","v":6.1458333333333339},10,{"$f":"I49/K49","v":0.38541666666666663},{"$f":"I49","v":3.8541666666666665}," Processing, interpretation\n        (sur 10)",{"$f":"'financial sheet'!CR4","v":3.8541666666666665},{"$f":"Q49-O49","v":6.1458333333333339},10,{"$f":"O49/Q49","v":0.38541666666666663},{"$f":"O49","v":3.8541666666666665}," Processing, interpretation\n        (sur 10)",{"$f":"'financial sheet'!CS4","v":3.8541666666666665},{"$f":"W49-U49","v":6.1458333333333339},10,{"$f":"U49/W49","v":0.38541666666666663},{"$f":"U49","v":3.8541666666666665},{"$f":"V49","v":6.1458333333333339}]
[null,{"$f":"B49","v":3.8541666666666665},{"$f":"C49","v":6.1458333333333339},{"$f":"D49","v":10},{"$f":"E49","v":0.38541666666666663},{"$f":"F49","v":3.8541666666666665},null,null,{"$f":"I49","v":3.8541666666666665},{"$f":"J49","v":6.1458333333333339},{"$f":"K49","v":10},{"$f":"L49","v":0.38541666666666663},{"$f":"M49","v":3.8541666666666665},null,{"$f":"O49","v":3.8541666666666665},{"$f":"P49","v":6.1458333333333339},{"$f":"Q49","v":10},{"$f":"R49","v":0.38541666666666663},{"$f":"S49","v":3.8541666666666665},null,{"$f":"U49","v":3.8541666666666665},6.1458333333333339,10,0.38541666666666663,3.8541666666666665,6.1458333333333339]
[null,{"$f":"B53","v":2.625},{"$f":"C53","v":3.375},{"$f":"D53","v":6},{"$f":"E53","v":0.4375},{"$f":"F53","v":2.625},null,null,{"$f":"I53","v":2.625},{"$f":"J53","v":3.375},{"$f":"K53","v":6},{"$f":"L53","v":0.4375},{"$f":"M53","v":2.625},null,{"$f":"O53","v":2.625},{"$f":"P53","v":3.375},{"$f":"Q53","v":6},{"$f":"R53","v":0.4375},{"$f":"S53","v":2.625},null,{"$f":"U53","v":2.625},3.375,6,0.4375,2.625,3.375]
["Diffusion information\n(sur 16)",{"$f":"B53","v":2.625},{"$f":"C53","v":3.375},{"$f":"D53","v":6},{"$f":"E53","v":0.4375},{"$f":"F53","v":2.625},null,"Diffusion information\n(sur 16)",{"$f":"I53","v":2.625},{"$f":"J53","v":3.375},{"$f":"K53","v":6},{"$f":"L53","v":0.4375},{"$f":"M53","v":2.625},"Diffusion information\n(sur 16)",{"$f":"O53","v":2.625},{"$f":"P53","v":3.375},{"$f":"Q53","v":6},{"$f":"R53","v":0.4375},{"$f":"S53","v":2.625},"Diffusion information\n(sur 16)",{"$f":"U53","v":2.625},3.375,6,0.4375,2.625,3.375]
[null,{"$f":"'Calculation sheet'!BD3","v":2.625},{"$f":"D53-B53","v":3.375},6,{"$f":"B53/D53","v":0.4375},{"$f":"B53","v":2.625},null,null,{"$f":"'financial sheet'!DC4","v":2.625},{"$f":"K53-I53","v":3.375},6,{"$f":"I53/K53","v":0.4375},{"$f":"I53","v":2.625},null,{"$f":"'financial sheet'!DD4","v":2.625},{"$f":"Q53-O53","v":3.375},6,{"$f":"O53/Q53","v":0.4375},{"$f":"O53","v":2.625},null,{"$f":"'financial sheet'!DE4","v":2.625},{"$f":"W53-U53","v":3.375},6,{"$f":"U53/W53","v":0.4375},{"$f":"U53","v":2.625},{"$f":"V53","v":3.375}]

{"sheet":"Calculation output 3","index":9,"n_rows":15,"n_cols":14,"rows_kept":15,"cut":false,"hidden":true,"merged":[]}
["OASIS"]
["Calculs sortie 2"]
[]
[{"$nulls":5},"date + 6 months",null,null,"date + 1 year",null,null,"date + 2 year"]
["Cirteria",null,"Note","Sur",null,null,"Note","Sur",null,"Note","Sur",null,"Note","Sur"]
["1-Sensitivity",{"$f":"C6/D6","v":0.66060606060606064},{"$f":"'Calculation sheet'!BG5","v":109},{"$f":"'Calculation sheet'!BH5","v":165},null,{"$f":"G6/H6","v":0.66060606060606064},{"$f":"'financial sheet'!DH6","v":109},{"$f":"D6","v":165},{"$f":"J6/K6","v":0.66060606060606064},{"$f":"'financial sheet'!DI6","v":109},{"$f":"D6","v":165},{"$f":"M6/N6","v":0.66060606060606064},{"$f":"'financial sheet'!DJ6","v":109},{"$f":"D6","v":165}]
["2-Specificity",{"$f":"C7/D7","v":0.41666666666666669},{"$f":"'Calculation sheet'!BI5","v":15},{"$f":"'Calculation sheet'!BJ5","v":36},null,{"$f":"G7/H7","v":0.41666666666666669},{"$f":"'financial sheet'!DL6","v":15},{"$f":"D7","v":36},{"$f":"J7/K7","v":0.41666666666666669},{"$f":"'financial sheet'!DM6","v":15},{"$f":"D7","v":36},{"$f":"M7/N7","v":0.41666666666666669},{"$f":"'financial sheet'!DN6","v":15},{"$f":"D7","v":36}]
["3-Representativness",0.4375,{"$f":"'Calculation sheet'!BK5","v":21},{"$f":"'Calculation sheet'!BL5","v":48},null,0.4375,{"$f":"'financial sheet'!DP6","v":21},48,0.4375,{"$f":"'financial sheet'!DQ6","v":21},48,0.4375,{"$f":"'financial sheet'!DR6","v":21},48]
["4-Rapidity",0.25308641975308643,{"$f":"'Calculation sheet'!BM5","v":20.5},{"$f":"'Calculation sheet'!BN5","v":81},null,0.25308641975308643,{"$f":"'financial sheet'!DT6","v":20.5},81,0.25308641975308643,{"$f":"'financial sheet'!DU6","v":20.5},81,0.25308641975308643,{"$f":"'financial sheet'!DV6","v":20.5},81]
["5-Flexibility",0.44252873563218392,{"$f":"'Calculation sheet'!BO5","v":38.5},{"$f":"'Calculation sheet'!BP5","v":87},null,0.44252873563218392,{"$f":"'financial sheet'!DX6","v":38.5},87,0.44252873563218392,{"$f":"'financial sheet'!DY6","v":38.5},87,0.44252873563218392,{"$f":"'financial sheet'!DZ6","v":38.5},87]
["6-Fiablity",0.55827067669172936,{"$f":"'Calculation sheet'!BQ5","v":222.75},{"$f":"'Calculation sheet'!BR5","v":399},null,0.55827067669172936,{"$f":"'financial sheet'!EB6","v":222.75},399,0.55827067669172936,{"$f":"'financial sheet'!EC6","v":222.75},399,0.55827067669172936,{"$f":"'financial sheet'!ED6","v":222.75},399]
["7-Stability",0.51881720430107525,{"$f":"'Calculation sheet'!BS5","v":96.5},{"$f":"'Calculation sheet'!BT5","v":186},null,0.51881720430107525,{"$f":"'financial sheet'!EF6","v":96.5},186,0.51881720430107525,{"$f":"'financial sheet'!EG6","v":96.5},186,0.51881720430107525,{"$f":"'financial sheet'!EH6","v":96.5},186]
["8-Acceptability",0.56209150326797386,{"$f":"'Calculation sheet'!BU5","v":86},{"$f":"'Calculation sheet'!BV5","v":153},null,0.56209150326797386,{"$f":"'financial sheet'!EJ6","v":86},153,0.56209150326797386,{"$f":"'financial sheet'!EK6","v":86},153,0.56209150326797386,{"$f":"'financial sheet'!EL6","v":86},153]
["9-Simplicity",0.6,{"$f":"'Calculation sheet'!BW5","v":36},{"$f":"'Calculation sheet'!BX5","v":60},null,0.6,{"$f":"'financial sheet'!EN6","v":36},60,0.6,{"$f":"'financial sheet'!EO6","v":36},60,0.6,{"$f":"'financial sheet'!EP6","v":36},60]
["10-Utility",0.671875,{"$f":"'Calculation sheet'!BY5","v":64.5},{"$f":"'Calculation sheet'!BZ5","v":96},null,0.671875,{"$f":"'financial sheet'!ER6","v":64.5},96,0.671875,{"$f":"'financial sheet'!ES6","v":64.5},96,0.671875,{"$f":"'financial sheet'!ET6","v":64.5},96]

{"sheet":"Calculation sheet","index":10,"n_rows":106,"n_cols":78,"rows_kept":106,"cut":false,"hidden":true,"merged":[]}
["SNAT"]
["Scoring grid",{"$nulls":6},"Objectifs (Prés / Exo)",null,"Echantillonnage Prés.",null,"Echantilonnage Exo",{"$nulls":9},"Animation Prés",null,"Animation Exo",{"$nulls":7},"Facteurs environnement",null,null,null,"Outils Prés. Et Exo",{"$nulls":9},"Recueil et circulation des données",null,null,null,"Traitement et interprétation des données",null,null,null,"Diffusion de l'information Prés.",null,"Diffusion de l'information Exo.",null,null,"Q1 : Sensibilité",null,"Q2 : Spécificité",null,"Q3 : Représentativité",null,"Q4 : Rapidité",null,"Q5 : Flexibilité",null,"Q6 : Fiabilité",null,"Q7 : Stabilité",null,"Q8 : Acceptabilité",null,"Q9 : Simplicité",null,"Q10 : Utilité"]
[{"$nulls":7},{"$f":"(H7/I8)*15","v":12},null,{"$f":"(N7/O8)*5+(P7/Q8)*5+(R7/S8)*5+(T7/U8)*5","v":7.5694444444444446},null,{"$f":"(J7/K8)*3+(L7/M8)*7+(R7/S8)*5+(T7/U8)*5","v":9.7222222222222232},{"$nulls":9},{"$f":"(V7/W8)*2+(X7/Y8)*2+(Z7/AA8)*1+(AB7/AC8)*5+(AD7/AE8)*5","v":8.0090909090909097},"Sur 15",{"$f":"(V7/W8)*4+(X7/Y8)*4+(Z7/AA8)*3+(AB7/AC8)*2+(AD7/AE8)*2","v":8.5636363636363644},"Sur 15",{"$nulls":6},{"$f":"(AF7/AG8)*2+(AH7/AI8)*2","v":0},"Sur",{"$f":"C70*2+C71*2","v":4},null,{"$f":"(AJ7/AK8)*4+(AL7/AM8)*4+(AN7/AO8)*4+(AP7/AQ8)*4+(AR7/AS8)*4","v":16.333333333333332},"Sur 20",{"$nulls":8},{"$f":"(AT7/AU8)*5+(AV7/AW8)*5","v":5.1190476190476186},"Sur 10",null,null,{"$f":"(AX7/AY8)*5+(AZ7/BA8)*5","v":3.8541666666666665},"Sur 10",null,null,{"$f":"(BB7/BC8)*5+(BD7/BE8)*5","v":4.375},"sur 10",{"$f":"(BB7/BC8)*3+(BD7/BE8)*3","v":2.625},"Sur 6",null,{"$f":"BG5/BH5","v":0.66060606060606064},null,{"$f":"BI5/BJ5","v":0.41666666666666669},null,{"$f":"BK5/BL5","v":0.4375},null,{"$f":"BM5/BN5","v":0.25308641975308643},null,{"$f":"BO5/BP5","v":0.44252873563218392},null,{"$f":"BQ5/BR5","v":0.55827067669172936},null,{"$f":"BS5/BT5","v":0.51881720430107525},null,{"$f":"BU5/BV5","v":0.56209150326797386},null,{"$f":"BW5/BX5","v":0.6},null,{"$f":"BY5/BZ5","v":0.671875}]
[{"$nulls":31},{"$f":"IF(AH3=0,1,AF3)","v":0},null,{"$f":"IF(AH3=0,1,AH3)","v":4},{"$nulls":24},"Total","Sur","Total","Sur","Total","Sur","Total","Sur","Total","Sur","Total","Sur","Total","Sur","Total","Sur","Total","Sur","Total","Sur"]
[{"$nulls":9},"Reglementation de la déclaration",null,"Suspicions Exhaustivité",null,"Suspicions Exactitude",null,"Suspicions Précision",null,"Infections Exactitude",null,"Infections précision",null,"Action spécifique",null,"Entretien de sensibilisation",null,"Evaluation sensibilisation",null,"Modalités animation",null,"Adéquation temps imparti",null,"Surveillance de la faune sauvage",null,"Surveillance et contrôle des vecteurs",null,"Outils de mesure",null,"Prélèvements",null,"Analyses de laboratoire",null,"Contrôle des réactifs de laboratoire",null,"Laboratoires",null,"Standardisation enquêteurs",null,"Qual et délais de circ des données",null,"Qualité du traitement",null,"Validation scientifique",null,"Qualité de l'information diffusée",null,"Périodicité et champ de diffusion",null,null,{"$f":"BG20*BH20+BG26*BH26+BG31*BH31+BG41*BH41+BG42*BH42+BG53*BH53+BG57*BH57+BG59*BH59+BG63*BH63+BG67*BH67+BG68*BH68+BG69*BH69+BG70*BH70+BG71*BH71+BG74*BH74+BG89*BH89+BG94*BH94+BG96*BH96+BG97*BH97+BG95*BH95","v":109},{"$f":"SUM(BH7:BH105)*3","v":165},{"$f":"BI43*BJ43+BI54*BJ54+BI68*BJ68+BI87*BJ87+BI89*BJ89","v":15},{"$f":"SUM(BJ7:BJ105)*3","v":36},{"$f":"BK25*BL25+BK31*BL31+BK67*BL67+BK69*BL69+BK72*BL72+BK74*BL74","v":21},{"$f":"SUM(BL7:BL105)*3","v":48},{"$f":"BM29*BN29+BM32*BN32+BM36*BN36+BM40*BN40+BM45*BN45+BM46*BN46+BM77*BN77+BM78*BN78+BM79*BN79+BM97*BN97","v":20.5},{"$f":"SUM(BN7:BN105)*3","v":81},{"$f":"BO16*BP16+BO17*BP17+BO18*BP18+BO20*BP20+BO25*BP25+BO30*BP30+BO40*BP40+BO89*BP89+BO103*BP103+BO105*BP105","v":38.5},{"$f":"SUM(BP7:BP105)*3","v":87},{"$f":"BQ10*BR10+BQ28*BR28+BQ39*BR39+BQ47*BR47+BQ80*BR80+BQ90*BR90+BQ11*BR11+BQ18*BR18+BQ21*BR21+BQ25*BR25+BQ26*BR26+BQ27*BR27+BQ29*BR29+BQ30*BR30+BQ32*BR32+BQ35*BR35+BQ36*BR36+BQ37*BR37+BQ38*BR38+BQ40*BR40+BQ41*BR41+BQ42*BR42+BQ43*BR43+BQ44*BR44+BQ45*BR45+BQ46*BR46+BQ50*BR50+BQ51*BR51+BQ52*BR52+BQ56*BR56+BQ57*BR57+BQ58*BR58+BQ59*BR59+BQ66*BR66+BQ72*BR72+BQ73*BR73+BQ74*BR74+BQ77*BR77+BQ79*BR79+BQ81*BR81+BQ83*BR83+BQ86*BR86+BQ87*BR87+BQ88*BR88+BQ102*BR102+BQ103*BR103+BQ104*BR104+BQ105*BR105","v":222.75},{"$f":"SUM(BR7:BR105)*3","v":399},{"$f":"BS12*BT12+BS22*BT22+BS16*BT16+BS17*BT17+BS18*BT18+BS19*BT19+BS25*BT25+BS28*BT28+BS39*BT39+BS80*BT80+BS90*BT90+BS99*BT99+BS29*BT29+BS32*BT32+BS36*BT36+BS37*BT37+BS38*BT38+BS44*BT44+BS50*BT50+BS51*BT51+BS77*BT77+BS93*BT93+BS96*BT96+BS94*BT94","v":96.5},{"$f":"SUM(BT7:BT105)*3","v":186},{"$f":"BU12*BV12+BU16*BV16+BU17*BV17+BU19*BV19+BU20*BV20+BU26*BV26+BU29*BV29+BU30*BV30+BU32*BV32+BU35*BV35+BU55*BV55+BU61*BV61+BU62*BV62+BU68*BV68+BU77*BV77+BU87*BV87+BU93*BV93+BU96*BV96+BU94*BV94","v":86},{"$f":"SUM(BV7:BV105)*3","v":153},{"$f":"BW16*BX16+BW45*BX45+BW55*BX55+BW61*BX61+BW62*BX62+BW77*BX77+BW87*BX87","v":36},{"$f":"SUM(BX7:BX105)*3","v":60},{"$f":"BY10*BZ10+BY12*BZ12+BY13*BZ13+BY19*BZ19+BY28*BZ28+BY57*BZ57+BY66*BZ66+BY82*BZ82+BY83*BZ83+BY77*BZ77+BY96*BZ96+BY98*BZ98+BY95*BZ95","v":64.5},{"$f":"SUM(BZ7:BZ105)*3","v":96}]
[null,"Note (sur 3)",{"$nulls":5},"Total","Sur","Total","Sur","Total","Sur","Total","Sur","Total","Sur","Total","Sur","Total","Sur","Total","Sur","Total","Sur","Total","Sur","Total","Sur","Total","Sur","Total","Sur","Total","Sur","Total","Sur","Total","Sur","Total","Sur","Total","Sur","Total","Sur","Total","Sur","Total","Sur","Total","Sur","Total","Sur","Total","Sur","Total","Sur",null,"Note","Coeff.","Note","Coeff.","Note","Coeff.","Note","Coeff.","Note","Coeff.","Note","Coeff.","Note","Coeff.","Note","Coeff.","Note","Coeff.","Note","Coeff."]
[null,"NA=No Applicable",null,null,null,"missing points",null,{"$f":"SUM(H10:H105)","v":12},{"$f":"(C10+C11+C12+C13+C66)*3","v":15},{"$f":"SUM(J10:J105)","v":0},{"$f":"C19*3","v":3},{"$f":"SUM(L10:L105)","v":15},{"$f":"(C31+C67*4+C69)*3","v":18},{"$f":"SUM(N10:N105)","v":15},{"$f":"(C31+C67*4+C69+C72+C74)*3","v":24},{"$f":"SUM(P10:P105)","v":1},{"$f":"(C69+C73+C74)*3","v":9},{"$f":"SUM(R10:R105)","v":14},{"$f":"(C25+C31+C67*3+C72)*3","v":18},{"$f":"SUM(T10:T105)","v":0},{"$f":"C73*3","v":3},{"$f":"SUM(V10:V105)","v":3},{"$f":"(C68+C87)*3","v":6},{"$f":"SUM(X10:X105)","v":9.5},{"$f":"(C35+C68+C89+C96+C95)*3","v":15},{"$f":"SUM(Z10:Z105)","v":2},{"$f":"C68*3","v":3},{"$f":"SUM(AB10:AB105)","v":19.75},{"$f":"(C17+C20+C21+C25+C26+C27+C28+C30+C40+C79+C86)*3","v":33},{"$f":"SUM(AD10:AD105)","v":2.5},{"$f":"(C16+C18)*3","v":6},{"$f":"SUM(AF10:AF105)","v":0},{"$f":"C70*3","v":3},{"$f":"SUM(AH10:AH105)","v":0},{"$f":"C71*3","v":3},{"$f":"SUM(AJ10:AJ105)","v":16},{"$f":"(C51+C52+C53+C54+C55+C87+C88+C89)*3","v":24},{"$f":"SUM(AL10:AL105)","v":14},{"$f":"(C50+C57+C58+C59+C87+C88+C89)*3","v":21},{"$f":"SUM(AN10:AN105)","v":9},{"$f":"(C35+C41+C42+C43)*3","v":12},{"$f":"SUM(AP10:AP105)","v":3},{"$f":"C44*3","v":3},{"$f":"SUM(AR10:AR105)","v":12},{"$f":"(C37+C38+C39+C47)*3","v":12},{"$f":"SUM(AT10:AT105)","v":12},{"$f":"(C16+C28+C30+C56+C59+C87+C88+C89)*3","v":24},{"$f":"SUM(AV10:AV105)","v":11},{"$f":"(C36+C46+C60+C61+C78+C94+C97)*3","v":21},{"$f":"SUM(AX10:AX105)","v":10.5},{"$f":"(C36+C45+C46+C77+C79+C81+C82+C86)*3","v":24},{"$f":"SUM(AZ10:AZ105)","v":3},{"$f":"(C18+C83+C86)*3","v":9},{"$f":"SUM(BB10:BB105)","v":1.5},{"$f":"(C93+C95)*3","v":6},{"$f":"SUM(BD10:BD105)","v":7.5},{"$f":"(C93+C96+C98+C95)*3","v":12}]
[{"$nulls":8},{"$f":"IF(I7=0,1,I7)","v":15},null,{"$f":"IF(K7=0,1,K7)","v":3},null,{"$f":"IF(M7=0,1,M7)","v":18},null,{"$f":"IF(O7=0,1,O7)","v":24},null,{"$f":"IF(Q7=0,1,Q7)","v":9},null,{"$f":"IF(S7=0,1,S7)","v":18},null,{"$f":"IF(U7=0,1,U7)","v":3},null,{"$f":"IF(W7=0,1,W7)","v":6},null,{"$f":"IF(Y7=0,1,Y7)","v":15},null,{"$f":"IF(AA7=0,1,AA7)","v":3},null,{"$f":"IF(AC7=0,1,AC7)","v":33},null,{"$f":"IF(AE7=0,1,AE7)","v":6},null,{"$f":"IF(AG7=0,1,AG7)","v":3},null,{"$f":"IF(AI7=0,1,AI7)","v":3},null,{"$f":"IF(AK7=0,1,AK7)","v":24},null,{"$f":"IF(AM7=0,1,AM7)","v":21},null,{"$f":"IF(AO7=0,1,AO7)","v":12},null,{"$f":"IF(AQ7=0,1,AQ7)","v":3},null,{"$f":"IF(AS7=0,1,AS7)","v":12},null,{"$f":"IF(AU7=0,1,AU7)","v":24},null,{"$f":"IF(AW7=0,1,AW7)","v":21},null,{"$f":"IF(AY7=0,1,AY7)","v":24},null,{"$f":"IF(BA7=0,1,BA7)","v":9},null,{"$f":"IF(BC7=0,1,BC7)","v":6},null,{"$f":"IF(BE7=0,1,BE7)","v":12}]
[{"$f":"'Scoring criteria'!A14","v":"Section 1: Objectives and context of surveillance"}]
["1.A.           Relevance of surveillance objectives",{"$f":"'Scoring criteria'!E15","v":3},{"$f":"IF(B10=\"NA\",0,1)","v":1},{"$nulls":4},{"$f":"B10","v":3},{"$nulls":60},{"$f":"SUM(B10)","v":3},{"$f":"C10*3","v":3},{"$nulls":6},{"$f":"SUM(B10)","v":3},{"$f":"C10*3","v":3}]
["1.B.           Level of detail, accuracy, and formalization of objectives",{"$f":"'Scoring criteria'!E16","v":3},{"$f":"IF(B11=\"SO\",0,1)","v":1},{"$nulls":4},{"$f":"B11","v":3},{"$nulls":60},{"$f":"SUM(B11)","v":3},{"$f":"C11*3","v":3}]
["1.C.           Taking partners’ expectations into account",{"$f":"'Scoring criteria'!E17","v":3},{"$f":"IF(B12=\"SO\",0,1)","v":1},{"$nulls":4},{"$f":"B12","v":3},{"$nulls":62},{"$f":"SUM(B12)","v":3},{"$f":"C12*3","v":3},{"$f":"SUM(B12)","v":3},{"$f":"C12*3","v":3},null,null,{"$f":"SUM(B12)","v":3},{"$f":"C12*3","v":3}]
["1.D.           Coherence of the diseases under surveillance with the sanitary situation (existing/exotic diseases or threats)",{"$f":"'Scoring criteria'!E18","v":3},{"$f":"IF(B13=\"SO\",0,1)","v":1},{"$nulls":4},{"$f":"B13","v":3},{"$nulls":68},{"$f":"SUM(B13)","v":3},{"$f":"C13*3","v":3}]
[null,{"$f":"SUM(B10:B13)","v":12},{"$f":"SUM(C10:C13)*3","v":12},{"$f":"B14/C14","v":1},{"$f":"B14","v":12},{"$f":"C14-B14","v":0}]
["Section 2: Central institutional organization"]
["2.A. Existence of an operational management structure (central unit)",{"$f":"'Scoring criteria'!E24","v":0.5},{"$f":"IF(B16=\"SO\",0,1)","v":1},{"$nulls":26},{"$f":"B16","v":0.5},{"$nulls":15},{"$f":"B16","v":0.5},{"$nulls":20},{"$f":"SUM(B16)","v":0.5},{"$f":"C16*3","v":3},null,null,{"$f":"SUM(B16)","v":0.5},{"$f":"C16*3","v":3},{"$f":"SUM(B16)","v":0.5},{"$f":"C16*3","v":3},{"$f":"SUM(B16)","v":0.5},{"$f":"C16*3","v":3}]
["2.B Existence of an operational steering structure that is representative of the partners (steering committee)",{"$f":"'Scoring criteria'!E25","v":1},1,{"$nulls":24},{"$f":"B17","v":1},{"$nulls":38},{"$f":"SUM(B17)","v":1},{"$f":"C17*3","v":3},null,null,{"$f":"SUM(B17)","v":1},{"$f":"C17*3","v":3},{"$f":"SUM(B17)","v":1},{"$f":"C17*3","v":3}]
["2.C. Existence of a scientific and technical committee for the system",{"$f":"'Scoring criteria'!E26","v":2},1,{"$nulls":26},{"$f":"B18","v":2},{"$nulls":21},{"$f":"B18","v":2},{"$nulls":14},{"$f":"SUM(B18)","v":2},{"$f":"C18*3","v":3},{"$f":"SUM(B18)","v":2},{"$f":"C18*3","v":3},{"$f":"SUM(B18)","v":2},{"$f":"C18*3","v":3}]
["2.D. Organization and operations of the system laid down in regulations, a charter, or a convention established between the partners",{"$f":"'Scoring criteria'!E27","v":0},1,{"$nulls":6},{"$f":"B19","v":0},{"$nulls":60},{"$f":"SUM(B19)","v":0},{"$f":"C19*3","v":3},{"$f":"SUM(B19)","v":0},{"$f":"C19*3","v":3},null,null,{"$f":"SUM(B19)","v":0},{"$f":"C19*1","v":1}]
["2.E. Frequency of meetings of the central coordinating body",{"$f":"'Scoring criteria'!E28","v":2},1,{"$nulls":24},{"$f":"B20","v":2},{"$nulls":30},{"$f":"SUM(B20)","v":2},{"$f":"C20*2","v":2},{"$nulls":6},{"$f":"SUM(B20)","v":2},{"$f":"C20*3","v":3},{"$nulls":4},{"$f":"SUM(B20)","v":2},{"$f":"C20*2","v":2}]
["2.F. Supervision of intermediary units by the central level",{"$f":"'Scoring criteria'!E29","v":2},1,{"$nulls":24},{"$f":"B21","v":2},{"$nulls":40},{"$f":"SUM(B21)","v":2},{"$f":"C21*3","v":3}]
["2.G. Adequacy of the central level’s material and financial resources  \n \n",{"$f":"'Scoring criteria'!E30","v":0},1,{"$nulls":67},{"$f":"SUM(B22)","v":0},{"$f":"C22*3","v":3}]
[null,{"$f":"SUM(B16:B22)","v":7.5},{"$f":"SUM(C16:C22)*3","v":21},{"$f":"B23/C23","v":0.35714285714285715},{"$f":"B23","v":7.5},{"$f":"C23-B23","v":13.5}]
["Section 3: Field institutional organization"]
["3.A. Existence of formal intermediary units covering the entire territory",{"$f":"'Scoring criteria'!E36","v":3},{"$f":"IF(B25=\"SO\",0,1)","v":1},{"$nulls":14},{"$f":"B25","v":3},{"$nulls":9},{"$f":"B25","v":3},{"$nulls":34},{"$f":"SUM(B25)","v":3},{"$f":"C25*1","v":1},null,null,{"$f":"SUM(B25)","v":3},{"$f":"C25*3","v":3},{"$f":"SUM(B25)","v":3},{"$f":"C25*2","v":2},{"$f":"SUM(B25)","v":3},{"$f":"C25*2","v":2}]
["3.B. Active role of intermediary units in the functioning of the system (validation, management, feedback)",{"$f":"'Scoring criteria'!E37","v":3},{"$f":"IF(B26=\"SO\",0,1)","v":1},{"$nulls":24},{"$f":"B26","v":3},{"$nulls":30},{"$f":"SUM(B26)","v":3},{"$f":"C26*1","v":1},{"$nulls":8},3,{"$f":"C26*2","v":2},null,null,{"$f":"SUM(B26)","v":3},{"$f":"C26*2","v":2}]
["3.C. Implementation of supervision by the intermediary level\n",{"$f":"'Scoring criteria'!E38","v":2.75},1,{"$nulls":24},{"$f":"B27","v":2.75},{"$nulls":40},2.75,{"$f":"C27*3","v":3}]
["3.D. Harmonization of intermediary units’ activities",{"$f":"'Scoring criteria'!E39","v":0},1,{"$nulls":24},{"$f":"B28","v":0},{"$nulls":17},{"$f":"B28","v":0},{"$nulls":22},0,{"$f":"C28*3","v":3},{"$f":"SUM(B28)","v":0},{"$f":"C28*2","v":2},{"$nulls":4},{"$f":"SUM(B28)","v":0},{"$f":"C28*2","v":2}]
["3.E. Adequacy of material and financial resources of intermediary units ",{"$f":"'Scoring criteria'!E40","v":0},1,{"$nulls":61},{"$f":"SUM(B29)","v":0},{"$f":"C29*3","v":3},null,null,0,{"$f":"C29*3","v":3},{"$f":"SUM(B29)","v":0},{"$f":"C29*2","v":2},{"$f":"SUM(B29)","v":0},{"$f":"C29*2","v":2}]
["3.F. Existence of coordination meetings at the intermediate level",{"$f":"'Scoring criteria'!E41","v":2},1,{"$nulls":24},{"$f":"B30","v":2},{"$nulls":17},{"$f":"B30","v":2},{"$nulls":20},{"$f":"SUM(B30)","v":2},{"$f":"C30*3","v":3},2,{"$f":"C30*1","v":1},null,null,{"$f":"SUM(B30)","v":2},{"$f":"C30*2","v":2}]
["3.G. Exhaustiveness or representativeness of the field agents’ coverage of the target population",{"$f":"'Scoring criteria'!E42","v":2},1,{"$nulls":8},{"$f":"B31","v":2},null,{"$f":"B31","v":2},null,null,null,{"$f":"B31","v":2},{"$nulls":40},{"$f":"SUM(B31)","v":2},{"$f":"C31*3","v":3},null,null,{"$f":"SUM(B31)","v":2},{"$f":"C31*3","v":3}]
["3.H. Adequacy of material and financial resources at the field level ",{"$f":"'Scoring criteria'!E43","v":0},1,{"$nulls":61},{"$f":"SUM(B32)","v":0},{"$f":"C32*3","v":3},null,null,{"$f":"SUM(B32)","v":0},{"$f":"C32*3","v":3},{"$f":"SUM(B32)","v":0},{"$f":"C32*3","v":3},{"$f":"SUM(B32)","v":0},{"$f":"C32*3","v":3}]
[null,{"$f":"SUM(B25:B32)","v":12.75},{"$f":"SUM(C25:C32)*3","v":24},{"$f":"B33/C33","v":0.53125},{"$f":"B33","v":12.75},{"$f":"C33-B33","v":11.25}]
["Section 4 : Laboratory"]
["4.A. Effective integration of laboratories in the surveillance system",{"$f":"'Scoring criteria'!E49","v":3},{"$f":"IF(B35=\"SO\",0,1)","v":1},{"$nulls":20},{"$f":"B35","v":3},{"$nulls":15},{"$f":"B35","v":3},{"$nulls":28},{"$f":"SUM(B35)","v":3},{"$f":"C35*3","v":3},null,null,{"$f":"SUM(B35)","v":3},{"$f":"C35*2","v":2}]
["4.B. Adequacy of human, material, and financial resources for diagnostic needs",{"$f":"'Scoring criteria'!E50","v":0},{"$f":"IF(B36=\"SO\",0,1)","v":1},{"$nulls":44},{"$f":"B36","v":0},null,{"$f":"B36","v":0},{"$nulls":14},{"$f":"SUM(B36)","v":0},{"$f":"C36*3","v":3},null,null,0,{"$f":"C36*3","v":3},{"$f":"SUM(B36)","v":0},{"$f":"C36*3","v":3}]
["4.C. Application of Quality Assurance for the tests undertaken",{"$f":"'Scoring criteria'!E51","v":3},1,{"$nulls":40},{"$f":"B37","v":3},{"$nulls":24},3,{"$f":"C37*3","v":3},{"$f":"SUM(B37)","v":3},{"$f":"C37*3","v":3}]
["4.D. Quality of the standardization of work between different laboratories",{"$f":"'Scoring criteria'!E52","v":3},1,{"$nulls":40},{"$f":"B38","v":3},{"$nulls":24},3,{"$f":"C38*3","v":3},{"$f":"SUM(B38)","v":3},{"$f":"C38*3","v":3}]
["4.E. Proportion of tests submitted to inter-laboratory trials",{"$f":"'Scoring criteria'!E53","v":3},1,{"$nulls":40},{"$f":"B39","v":3},{"$nulls":24},{"$f":"SUM(B39)","v":3},{"$f":"C39*3","v":3},{"$f":"SUM(B39)","v":3},{"$f":"C39*3","v":3}]
["4.F. Existence of an investigation team to support field agents",{"$f":"'Scoring criteria'!E54","v":2},1,{"$nulls":24},{"$f":"B40","v":2},{"$nulls":36},{"$f":"SUM(B40)","v":2},{"$f":"C40*1","v":1},{"$f":"SUM(B40)","v":2},{"$f":"C40*2","v":2},2,{"$f":"C40*1","v":1}]
["4.G. Relevance of diagnostic techniques",{"$f":"'Scoring criteria'!E55","v":3},1,{"$nulls":36},{"$f":"B41","v":3},{"$nulls":18},{"$f":"SUM(B41)","v":3},{"$f":"C41*3","v":3},{"$nulls":8},3,{"$f":"C41*3","v":3}]
["4.H. Sensitivity of diagnostic techniques",{"$f":"'Scoring criteria'!E56","v":1.5},1,{"$nulls":36},{"$f":"B42","v":1.5},{"$nulls":18},{"$f":"SUM(B42)","v":1.5},{"$f":"C42*3","v":3},{"$nulls":8},1.5,{"$f":"C42*3","v":3}]
["4.I. Specificity of diagnostic techniques",{"$f":"'Scoring criteria'!E57","v":1.5},1,{"$nulls":36},{"$f":"B43","v":1.5},{"$nulls":20},{"$f":"SUM(B43)","v":1.5},{"$f":"C43*3","v":3},{"$nulls":6},1.5,{"$f":"C43*3","v":3}]
["4.J. Control of laboratory reagents",{"$f":"'Scoring criteria'!E58","v":3},1,{"$nulls":38},{"$f":"B44","v":3},{"$nulls":26},3,{"$f":"C44*3","v":3},{"$f":"SUM(B44)","v":3},{"$f":"C44*3","v":3}]
["4.K. Technical level of data management at the laboratory",{"$f":"'Scoring criteria'!E59","v":1.5},1,{"$nulls":46},{"$f":"B45","v":1.5},{"$nulls":14},{"$f":"SUM(B45)","v":1.5},{"$f":"C45*3","v":3},null,null,1.5,{"$f":"C45*3","v":3},{"$nulls":4},{"$f":"SUM(B45)","v":1.5},{"$f":"C45*2","v":2}]
["4.L. Analysis deadlines at the laboratory (formalization, standardization, verification, transfer of results to the central unit)",{"$f":"'Scoring criteria'!E60","v":0},1,{"$nulls":44},{"$f":"B46","v":0},null,{"$f":"B46","v":0},{"$nulls":14},{"$f":"SUM(B46)","v":0},{"$f":"C46*6","v":6},null,null,0,{"$f":"C46*1","v":1}]
["4. M. Quality of results delivered",{"$f":"'Scoring criteria'!E61","v":3},1,{"$nulls":40},{"$f":"B47","v":3},{"$nulls":24},{"$f":"SUM(B47)","v":3},{"$f":"C47*3","v":3}]
[null,{"$f":"SUM(B35:B47)","v":27.5},{"$f":"SUM(C35:C47)*3","v":39},{"$f":"B48/C48","v":0.70512820512820518},{"$f":"B48","v":27.5},{"$f":"C48-B48","v":11.5}]
["Section 5: Surveillance tools"]
["5.A. Existence of a formalized surveillance protocol for each disease or threat under surveillance",{"$f":"'Scoring criteria'!E67","v":2},{"$f":"IF(B50=\"SO\",0,1)","v":1},{"$nulls":34},{"$f":"B50","v":2},{"$nulls":30},{"$f":"SUM(B50)","v":2},{"$f":"C50*3","v":3},{"$f":"SUM(B50)","v":2},{"$f":"C50*3","v":3}]
["5.B. Standardization of data collected",{"$f":"'Scoring criteria'!E68","v":3},1,{"$nulls":32},{"$f":"B51","v":3},{"$nulls":32},{"$f":"SUM(B51)","v":3},{"$f":"C51*3","v":3},{"$f":"SUM(B51)","v":3},{"$f":"C51*3","v":3}]
["5.C. Relevance of measurement tools (excluding laboratory tools)",{"$f":"'Scoring criteria'!E69","v":3},1,{"$nulls":32},{"$f":"B52","v":3},{"$nulls":32},{"$f":"SUM(B52)","v":3},{"$f":"C52*3","v":3}]
["5.D. Sensitivity of the case or threat definition",{"$f":"'Scoring criteria'!E70","v":3},1,{"$nulls":32},{"$f":"B53","v":3},{"$nulls":22},{"$f":"SUM(B53)","v":3},{"$f":"C53*3","v":3}]
["5.E. Specificity of the case or threat definition",{"$f":"'Scoring criteria'!E71","v":1.5},1,{"$nulls":32},{"$f":"B54","v":1.5},{"$nulls":24},{"$f":"SUM(B54)","v":1.5},{"$f":"C54*3","v":3}]
["5.F. Simplicity of the case or threat definition",{"$f":"'Scoring criteria'!E72","v":2},1,{"$nulls":32},{"$f":"B55","v":2},{"$nulls":36},{"$f":"SUM(B55)","v":2},{"$f":"C55*3","v":3},{"$f":"SUM(B55)","v":2},{"$f":"C55*3","v":3}]
["5.G. Quality of the filling out of investigation forms",{"$f":"'Scoring criteria'!E73","v":3},1,{"$nulls":42},{"$f":"B56","v":3},{"$nulls":22},{"$f":"SUM(B56)","v":3},{"$f":"C56*3","v":3}]
["5.H. Relevance of collected  samples",{"$f":"'Scoring criteria'!E74","v":2.5},1,{"$nulls":34},{"$f":"B57","v":2.5},{"$nulls":20},{"$f":"SUM(B57)","v":2.5},{"$f":"C57*3","v":3},{"$nulls":8},{"$f":"SUM(B57)","v":2.5},{"$f":"C57*3","v":3},{"$nulls":6},{"$f":"SUM(B57)","v":2.5},{"$f":"C57*3","v":3}]
["5.I. Standardization of collected samples",{"$f":"'Scoring criteria'!E75","v":3},1,{"$nulls":34},{"$f":"B58","v":3},{"$nulls":30},{"$f":"SUM(B58)","v":3},{"$f":"C58*3","v":3}]
["5.J. Quality of samples collected",{"$f":"'Scoring criteria'!E76","v":3},1,{"$nulls":34},{"$f":"B59","v":3},{"$nulls":7},{"$f":"B59","v":3},{"$nulls":12},{"$f":"SUM(B59)","v":3},{"$f":"C59*3","v":3},{"$nulls":8},{"$f":"SUM(B59)","v":3},{"$f":"C59*3","v":3}]
["5.K. Respect of the interval between the detection of a case or threat and the delivery of results",{"$f":"'Scoring criteria'!E77","v":3},1,{"$nulls":44},{"$f":"B60","v":3}]
["5.L. Simplicity of the notification procedure",{"$f":"'Scoring criteria'!E78","v":2},1,{"$nulls":44},{"$f":"B61","v":2},{"$nulls":24},{"$f":"SUM(B61)","v":2},{"$f":"C61*3","v":3},{"$f":"SUM(B61)","v":2},{"$f":"C61*3","v":3}]
["5.M. Simplicity of the data collection procedure",{"$f":"'Scoring criteria'!E79","v":2.5},1,{"$nulls":69},{"$f":"SUM(B62)","v":2.5},{"$f":"C62*3","v":3},{"$f":"SUM(B62)","v":2.5},{"$f":"C62*3","v":3}]
["5.N. Acceptability of the consequences of a suspicion or case for the source or collector of data",{"$f":"'Scoring criteria'!E80","v":1.5},1,{"$nulls":55},{"$f":"SUM(B63)","v":1.5},{"$f":"C63*3","v":3}]
[null,{"$f":"SUM(B50:B63)","v":35},{"$f":"SUM(C50:C63)*3","v":42},{"$f":"B64/C64","v":0.83333333333333337},{"$f":"B64","v":35},{"$f":"C64-B64","v":7}]
["Section 6: Surveillance procedures"]
["6.A. Appropriateness of surveillance procedures with the system's objectives",{"$f":"'Scoring criteria'!E86","v":0},{"$f":"IF(B66=\"SO\",0,1)","v":1},{"$nulls":4},{"$f":"B66","v":0},{"$nulls":60},{"$f":"SUM(B66)","v":0},{"$f":"C66*3","v":3},{"$nulls":6},{"$f":"SUM(B66)","v":0},{"$f":"C66*3","v":3}]
["6.B. Existence of passive (event-based) surveillance whose results are exhaustive or representative",{"$f":"'Scoring criteria'!E87","v":3},1,{"$nulls":8},{"$f":"B67*4","v":12},null,{"$f":"B67*4","v":12},null,null,null,{"$f":"B67*3","v":9},{"$nulls":40},{"$f":"SUM(B67)","v":3},{"$f":"C67*6","v":6},null,null,{"$f":"SUM(B67)","v":3},{"$f":"C67*3","v":3}]
["6.C. Existence of awareness building programs for data sources in a passive (event-based) network ",{"$f":"'Scoring criteria'!E88","v":2},1,{"$nulls":18},{"$f":"B68","v":2},null,{"$f":"B68","v":2},null,{"$f":"B68","v":2},{"$nulls":32},{"$f":"SUM(B68)","v":2},{"$f":"C68*3","v":3},{"$f":"SUM(B68)","v":2},{"$f":"C68*2","v":2},{"$nulls":10},{"$f":"SUM(B68)","v":2},{"$f":"C68*3","v":3}]
["6.D. Relevance and suitability of active (planned) surveillance protocols ",{"$f":"'Scoring criteria'!E89","v":1},1,{"$nulls":8},{"$f":"B69","v":1},null,{"$f":"B69","v":1},null,{"$f":"B69","v":1},{"$nulls":42},{"$f":"SUM(B69)","v":1},{"$f":"C69*3","v":3},null,null,{"$f":"SUM(B69)","v":1},{"$f":"C69*3","v":3}]
["6.E. Surveillance of susceptible wild animals",{"$f":"'Scoring criteria'!E90","v":0},1,{"$nulls":28},{"$f":"B70","v":0},{"$nulls":26},{"$f":"SUM(B70)","v":0},{"$f":"C70*2","v":2}]
["6.F. Vector surveillance and control",{"$f":"'Scoring criteria'!E91","v":"NA"},1,{"$nulls":30},{"$f":"B71","v":"NA"},{"$nulls":24},{"$f":"SUM(B71)","v":0},{"$f":"C71*1","v":1}]
["6.G. Representativeness of the populations targeted by sampling in active (planned) surveillance",{"$f":"'Scoring criteria'!E92","v":"NA"},1,{"$nulls":10},{"$f":"B72","v":"NA"},null,null,null,{"$f":"B72","v":"NA"},{"$nulls":44},{"$f":"SUM(B72)","v":0},{"$f":"C72*3","v":3},{"$nulls":4},{"$f":"SUM(B72)","v":0},{"$f":"C72*3","v":3}]
["6.H. Precision of sample under active (planned) surveillance",{"$f":"'Scoring criteria'!E93","v":"NA"},1,{"$nulls":12},{"$f":"B73","v":"NA"},null,null,null,{"$f":"B73","v":"NA"},{"$nulls":48},{"$f":"SUM(B73)","v":0},{"$f":"C73*2","v":2}]
["6.I. Level of satisfaction of active (planned) surveillance completeness rate",{"$f":"'Scoring criteria'!E94","v":"NA"},1,{"$nulls":10},{"$f":"B74","v":"NA"},null,{"$f":"B74","v":"NA"},{"$nulls":42},{"$f":"SUM(B74)","v":0},{"$f":"C74*3","v":3},null,null,{"$f":"SUM(B74)","v":0},{"$f":"C74*3","v":3},{"$nulls":4},{"$f":"SUM(B74)","v":0},{"$f":"C74*3","v":3}]
[null,{"$f":"SUM(B66:B74)","v":6},{"$f":"SUM(C66:C74)*3","v":27},{"$f":"B75/C75","v":0.22222222222222221},{"$f":"B75","v":6},{"$f":"C75-B75","v":21}]
["Section 7: Data management"]
["7.A. Adequacy of the data management system for the needs of the system (relational database, etc.)",{"$f":"'Scoring criteria'!E100","v":3},{"$f":"IF(B77=\"SO\",0,1)","v":1},{"$nulls":46},{"$f":"B77","v":3},{"$nulls":14},{"$f":"SUM(B77)","v":3},{"$f":"C77*2","v":2},null,null,{"$f":"SUM(B77)","v":3},{"$f":"C77*2","v":2},{"$f":"SUM(B77)","v":3},{"$f":"C77*1","v":1},{"$f":"SUM(B77)","v":3},{"$f":"C77*2","v":2},{"$f":"SUM(B77)","v":3},{"$f":"C77*3","v":3},{"$f":"SUM(B77)","v":3},{"$f":"C77*3","v":3}]
["7.B. Data input interval in accordance with the objectives and use of system results",{"$f":"'Scoring criteria'!E101","v":0},1,{"$nulls":44},{"$f":"B78","v":0},{"$nulls":16},{"$f":"SUM(B78)","v":0},{"$f":"C78*2","v":2}]
["7.C. Designated staff available and trained in data entry, management and analysis.",{"$f":"'Scoring criteria'!E102","v":1},1,{"$nulls":24},{"$f":"B79","v":1},{"$nulls":21},{"$f":"B79","v":1},{"$nulls":14},{"$f":"SUM(B79)","v":1},{"$f":"C79*2","v":2},null,null,{"$f":"SUM(B79)","v":1},{"$f":"C79*3","v":3}]
["7.D. Adequacy of material and financial resources for data management and analysis",{"$f":"'Scoring criteria'!E103","v":0},1,{"$nulls":65},{"$f":"SUM(B80)","v":0},{"$f":"C80*3","v":3},{"$f":"SUM(B80)","v":0},{"$f":"C80*2","v":2}]
["7.E. Data verification and validation procedures formalized and operational",{"$f":"'Scoring criteria'!E104","v":1},1,{"$nulls":46},{"$f":"B81","v":1},{"$nulls":18},{"$f":"SUM(B81)","v":1},{"$f":"C81*3","v":3}]
["7.F. Complete descriptive processing of data",{"$f":"'Scoring criteria'!E105","v":3},1,{"$nulls":46},{"$f":"B82","v":3},{"$nulls":26},{"$f":"SUM(B82)","v":3},{"$f":"C82*1","v":1}]
["7.G. Exploitation of data fits the needs of the system (if possible regular and multi-disciplinary)",{"$f":"'Scoring criteria'!E106","v":0},1,{"$nulls":48},{"$f":"B83","v":0},{"$nulls":16},{"$f":"SUM(B83)","v":0},{"$f":"C83*3","v":3},{"$nulls":6},{"$f":"SUM(B83)","v":0},{"$f":"C83*3","v":3}]
[null,{"$f":"SUM(B77:B83)","v":8},{"$f":"SUM(C77:C83)*3","v":21},{"$f":"B84/C84","v":0.38095238095238093},{"$f":"B84","v":8},{"$f":"C84-B84","v":13}]
["Section 8: Training"]
["8.A. Adequate skill level in epidemiology of members of the central unit",{"$f":"'Scoring criteria'!E112","v":1},{"$f":"IF(B86=\"SO\",0,1)","v":1},{"$nulls":24},{"$f":"B86","v":1},{"$nulls":21},{"$f":"B86","v":1},null,{"$f":"B86","v":1},{"$nulls":16},{"$f":"SUM(B86)","v":1},{"$f":"C86*3","v":3}]
["8.B. Initial training implemented for all field agents when joining the system",{"$f":"'Scoring criteria'!E113","v":1},{"$f":"IF(B87=\"SO\",0,1)","v":1},{"$nulls":18},{"$f":"B87","v":1},{"$nulls":13},{"$f":"B87","v":1},null,{"$f":"B87","v":1},{"$nulls":7},{"$f":"B87","v":1},{"$nulls":14},{"$f":"SUM(B87)","v":1},{"$f":"C87*2","v":2},{"$nulls":6},{"$f":"SUM(B87)","v":1},{"$f":"C87*3","v":3},null,null,{"$f":"SUM(B87)","v":1},{"$f":"C87*3","v":3},{"$f":"SUM(B87)","v":1},{"$f":"C87*3","v":3}]
["8.C. Objectives and contents of initial training of system field actors adequate for operational surveillance needs",{"$f":"'Scoring criteria'!E114","v":2.5},{"$f":"IF(B88=\"SO\",0,1)","v":1},{"$nulls":32},{"$f":"B88","v":2.5},null,{"$f":"B88","v":2.5},{"$nulls":7},{"$f":"B88","v":2.5},{"$nulls":22},{"$f":"SUM(B88)","v":2.5},{"$f":"C88*3","v":3}]
["8.D. Regular advanced training",{"$f":"'Scoring criteria'!E115","v":0},{"$f":"IF(B89=\"SO\",0,1)","v":1},{"$nulls":20},{"$f":"B89","v":0},{"$nulls":11},{"$f":"B89","v":0},null,{"$f":"B89","v":0},{"$nulls":7},{"$f":"B89","v":0},{"$nulls":12},{"$f":"SUM(B89)","v":0},{"$f":"C89*3","v":3},{"$f":"SUM(B89)","v":0},{"$f":"C89*2","v":2},{"$nulls":4},{"$f":"SUM(B89)","v":0},{"$f":"C89*3","v":3}]
["8.E. Adequacy of material and financial resources for training",{"$f":"'Scoring criteria'!E116","v":1},{"$f":"IF(B90=\"SO\",0,1)","v":1},{"$nulls":65},{"$f":"SUM(B90)","v":1},{"$f":"C90*2","v":2},{"$f":"SUM(B90)","v":1},{"$f":"C90*2","v":2}]
[null,{"$f":"SUM(B86:B90)","v":5.5},{"$f":"SUM(C86:C90)*3","v":15},{"$f":"B91/C91","v":0.36666666666666664},{"$f":"B91","v":5.5},{"$f":"C91-B91","v":9.5}]
["Section 9 : Communication"]
["9.A Edition régulière de rapports et articles scientifiques sur les résultats de la surveillance",{"$f":"'Scoring criteria'!E122","v":0},{"$f":"IF(B93=\"SO\",0,1)","v":1},{"$nulls":50},{"$f":"B93","v":0},null,{"$f":"B93","v":0},{"$nulls":14},{"$f":"SUM(B93)","v":0},{"$f":"C93*2","v":2},{"$f":"SUM(B93)","v":0},{"$f":"C93*3","v":3}]
["9.B Restitution des résultats des analyses individuelles aux acteurs de terrain",{"$f":"'Scoring criteria'!E123","v":3},{"$f":"IF(B94=\"SO\",0,1)","v":1},{"$nulls":44},{"$f":"B94","v":3},{"$nulls":10},{"$f":"SUM(B94)","v":3},{"$f":"C94*3","v":3},{"$nulls":10},{"$f":"SUM(B94)","v":3},{"$f":"C94*3","v":3},{"$f":"SUM(B94)","v":3},{"$f":"C94*3","v":3}]
["9.C Diffusion régulière d’un bulletin d’information pertinent",{"$f":"'Scoring criteria'!E124","v":1.5},{"$f":"IF(B95=\"SO\",0,1)","v":1},{"$nulls":20},{"$f":"B95","v":1.5},{"$nulls":29},{"$f":"B95","v":1.5},null,{"$f":"B95","v":1.5},null,null,{"$f":"SUM(B95)","v":1.5},{"$f":"C95*3","v":3},{"$nulls":16},{"$f":"SUM(B95)","v":1.5},{"$f":"C95*2","v":2}]
["9.D Restitution systématique des bilans de résultats aux acteurs de terrain (hors bulletin)",{"$f":"'Scoring criteria'!E125","v":3},1,{"$nulls":20},{"$f":"B96","v":3},{"$nulls":31},{"$f":"B96","v":3},null,null,{"$f":"SUM(B96)","v":3},{"$f":"C96*3","v":3},{"$nulls":10},{"$f":"SUM(B96)","v":3},{"$f":"C96*2","v":2},{"$f":"SUM(B96)","v":3},{"$f":"C96*3","v":3},null,null,{"$f":"SUM(B96)","v":3},{"$f":"C96*3","v":3}]
["9.E Présence d’un système d’échange d’informations organisé transversalement et verticalement entre les acteurs de terrain (mail et /ou web)",{"$f":"'Scoring criteria'!E126","v":3},1,{"$nulls":44},{"$f":"B97","v":3},{"$nulls":10},{"$f":"SUM(B97)","v":3},{"$f":"C97*1","v":1},{"$nulls":4},{"$f":"SUM(B97)","v":3},{"$f":"C97*2","v":2}]
["9.F Politique de communication externe solide",{"$f":"'Scoring criteria'!E127","v":3},1,{"$nulls":52},{"$f":"B98","v":3},{"$nulls":20},{"$f":"SUM(B98)","v":3},{"$f":"C98*2","v":2}]
["9.G Suffisance des moyens humains, matériels et financiers pour la communication",{"$f":"'Scoring criteria'!E128","v":0},1,{"$nulls":67},{"$f":"SUM(B99)","v":0},{"$f":"C99*2","v":2}]
[null,{"$f":"SUM(B93:B99)","v":13.5},{"$f":"SUM(C93:C99)*3","v":21},{"$f":"B100/C100","v":0.6428571428571429},{"$f":"B100","v":13.5},{"$f":"C100-B100","v":7.5}]
["Section 10 : Evaluation"]
["10.A Système d’indicateurs de performance développé et validé par les responsables du réseau",{"$f":"'Scoring criteria'!E134","v":0},{"$f":"IF(B102=\"SO\",0,1)","v":1},{"$nulls":65},{"$f":"SUM(B102)","v":0},{"$f":"C102*3","v":3}]
["10.B Indicateurs de performance régulièrement calculés, interprétés et diffusés",{"$f":"'Scoring criteria'!E135","v":0},{"$f":"IF(B103=\"SO\",0,1)","v":1},{"$nulls":63},{"$f":"SUM(B103)","v":0},{"$f":"C103*3","v":3},{"$f":"SUM(B103)","v":0},{"$f":"C103*3","v":3}]
["10.C Evaluation externes effectuées",{"$f":"'Scoring criteria'!E136","v":1},{"$f":"IF(B104=\"SO\",0,1)","v":1},{"$nulls":65},{"$f":"SUM(B104)","v":1},{"$f":"C104*3","v":3}]
["10.D Mise en œuvre des mesures correctrices",{"$f":"'Scoring criteria'!E137","v":1},{"$f":"IF(B105=\"SO\",0,1)","v":1},{"$nulls":63},{"$f":"SUM(B105)","v":1},{"$f":"C105*3","v":3},{"$f":"SUM(B105)","v":1},{"$f":"C105*3","v":3}]
[null,{"$f":"SUM(B102:B105)","v":2},{"$f":"SUM(C102:C105)*3","v":12},{"$f":"B106/C106","v":0.16666666666666666},{"$f":"B106","v":2},{"$f":"C106-B106","v":10}]

{"sheet":"General_feedback","index":11,"n_rows":102,"n_cols":4,"rows_kept":102,"cut":false,"hidden":true,"merged":[[1,2,1,3],[0,2,0,3],[72,2,72,3],[81,2,81,3],[88,2,88,3],[97,2,97,3],[5,2,5,3],[11,2,11,3],[20,2,20,3],[30,2,30,3],[45,2,45,3],[61,2,61,3]]}
[null,null,"General feedback"]
[null,null,"For each criterion all the question concerned are referenced here."]
[]
[]
[null,null,"Criterion","Referencing question"]
[null,null,"Section 1"]
[null,null,"1.A","Section 1 question 1 and 3"]
[null,null,"1.B","Section 1 question 1 and 2"]
[null,null,"1.C","Section 1 question 4"]
[null,null,"1.D","Section 1 question 3"]
[]
[null,null,"Section2"]
[null,null,"2.A","Section 2 question 8, 10, 11, 21 and 23"]
[null,null,"2.B","Section 2 question 29, 32, 35, 38, 39 and 40"]
[null,null,"2.C","Section 2 question 42, 45, 46, 48, 52 and 54"]
[null,null,"2.D","Section 2 question 57, 58 and 59"]
[null,null,"2.E","Section 2 question 61, 62, 65 and 67"]
[null,null,"2.F","Section 2 question 68, 70 and 73"]
[null,null,"2.G","Section 2 question 24, 27, 41 and 55 "]
[]
[null,null,"Section 3"]
[null,null,"3.A","Section 3 question 1, 6 and 12"]
[null,null,"3.B","Section 3 question 13"]
[null,null,"3.C","Section 3 question 24, 27 and 29"]
[null,null,"3.D","Section 3 question 17, 18 and 19"]
[null,null,"3.E","Section 3 question 21, 22 and 23"]
[null,null,"3.F","section 3 queston 38, 41 and 48 OR Section 3 question 52, 53 and 54"]
[null,null,"3.G","Section 3 question 30, 35 and 37"]
[null,null,"3.H","Section 3 question  57, 58 and 59"]
[]
[null,null,"Section 4"]
[null,null,"4.A","Section 4 question 1 and 2"]
[null,null,"4.B","Section 4 question 8, 9, 10, 35, 36 and 37"]
[null,null,"4.C","Section 4 table at the end of the section column l"]
[null,null,"4.D","Section 4 question 3, 21, 48 and 49"]
[null,null,"4.E","Section 4 table at the end of the section column m"]
[null,null,"4.F","Section 4 question 52 and 53"]
[null,null,"4.G","Section 4 question 54, 55 and 56"]
[null,null,"4.H","Section 4 table at the end of the section column b"]
[null,null,"4.I","Section 4 table at the end of the section column c"]
[null,null,"4.J","Section 4 question 23 and 51"]
[null,null,"4.K","Section 4 question 15, 18 and 45"]
[null,null,"4.L","Section 4 table at the end of the section column j and k and question 20 and 47"]
[null,null,"4.M","Section 4 question 58 and 59"]
[]
[null,null,"Section 5"]
[null,null,"5.A","Section 5 question 1 and 2 to 13"]
[null,null,"5.B","Section 5 question 14, 23, 24, 33 and 34"]
[null,null,"5.C","Section 5 question 30 and section 1 question 1 and 3"]
[null,null,"5.D","Section 5 question 16"]
[null,null,"5.E","Section 5 question 17"]
[null,null,"5.F","Section 5 question 18"]
[null,null,"5.G","Section 5 question 23 and 28"]
[null,null,"5.H","Section 5 question 36 and 40 and section 1 question 1 and 3"]
[null,null,"5.I","Section 5 question 41 and 42"]
[null,null,"5.J","Section 5 question 44"]
[null,null,"5.K","Section 5 question 50, 51, 52 et 53"]
[null,null,"5.L","Section 5 question 27, 48, 55 and 56"]
[null,null,"5.M","Section 5 question 31, 32, 37, 38 and 39"]
[null,null,"5.N","Section 5 uqestion 57 and 58"]
[]
[null,null,"Section 6"]
[null,null,"6.A","Section 5 question 89, 87 and 88"]
[null,null,"6.B","Section 5 qustion 64 and 65"]
[null,null,"6.C","Section 5 question 59, 60, 61 and 62"]
[null,null,"6.D","Section 5 question 67, 69 and 70"]
[null,null,"6.E","Section 5 question 80, 79 and 82"]
[null,null,"6.F","Section 5 question 84, 83 and 86"]
[null,null,"6.G","Section 5 question 73 and 53"]
[null,null,"6.H","Section 3 question 50 and 51, section 4 table at the end of the section column b and c"]
[null,null,"6.I","Section 5 question 77 and 78"]
[]
[null,null,"Section 7 "]
[null,null,"7.A","Section 7 question 3, 8 and 9 "]
[null,null,"7.B","Section 7 question 18"]
[null,null,"7.C","Section 7 question 52"]
[null,null,"7.D","Section 7 question 28, 50 and 51"]
[null,null,"7.E","Section 7 question 25, 26 and 27"]
[null,null,"7.F","Section 7 question 36, 37, 38, 40 and 49"]
[null,null,"7.G","Section 7 question 31, 33 and 34"]
[]
[null,null,"Section 8"]
[null,null,"8.A","Section 8 question 2 and 4"]
[null,null,"8.B","Section 8 question 9 and 10"]
[null,null,"8.C","Section 8 question 11"]
[null,null,"8.D","Section 8 question 14 and 20"]
[null,null,"8.E","Section 8 question 19"]
[]
[null,null,"Section 9 "]
[null,null,"9.A","Section 9 question 9, 10 and 11"]
[null,null,"9.B","Section 9 question 14"]
[null,null,"9.C","Section 9 question 33, 34, 35, 36 and 40"]
[null,null,"9.D","Section 9 question 25 and 26"]
[null,null,"9.E","Section 9 question 13 and 16 "]
[null,null,"9.F","Section 9 question 24 and 32"]
[null,null,"9.G","Section 9 question 42, 43 and 44"]
[]
[null,null,"Section 10 "]
[null,null,"10.A","Section 10 question 1, 3, 4 and 5"]
[null,null,"10.B","Section 10 question 6, 7, 9 and 10"]
[null,null,"10.C","Section 10 question 12, 15 and 16"]
[null,null,"10.D","Section 10 question 19 and 20"]

{"sheet":"financial sheet","index":12,"n_rows":132,"n_cols":151,"rows_kept":132,"cut":false,"hidden":true,"merged":[[5,106,5,108],[5,62,5,64],[5,66,5,68],[5,70,5,72],[5,74,5,76],[5,78,5,80],[5,82,5,84],[5,86,5,88],[5,90,5,92],[5,94,5,96],[5,98,5,100],[5,102,5,104],[5,58,5,60],[5,14,5,16],[5,18,5,20],[5,22,5,24],[5,26,5,28],[5,30,5,32],[5,34,5,36],[5,38,5,40],[5,42,5,44],[5,46,5,48],[5,50,5,52],[5,54,5,56]]}
["SNAT"]
["Scoring grid",{"$nulls":9},"Objectifs (Prés / Exo)",null,null,null,"Echantillonnage Prés.",null,null,null,"Echantilonnage Exo",{"$nulls":19},"Animation Prés",null,null,null,"Animation Exo",{"$nulls":15},"Facteurs environnement",{"$nulls":7},"Outils Prés. Et Exo",{"$nulls":19},"Recueil et circulation des données",{"$nulls":7},"Traitement et interprétation des données",{"$nulls":7},"Diffusion de l'information Prés.",null,null,null,"Diffusion de l'information Exo.",{"$nulls":4},"Q1 : Sensibilité",null,null,null,"Q2 : Spécificité",null,null,null,"Q3 : Représentativité",null,null,null,"Q4 : Rapidité",null,null,null,"Q5 : Flexibilité",null,null,null,"Q6 : Fiabilité",null,null,null,"Q7 : Stabilité",null,null,null,"Q8 : Acceptabilité",null,null,null,"Q9 : Simplicité",null,null,null,"Q10 : Utilité"]
[{"$nulls":10},"date + 6 month","date + 1 year","date + 2 years",null,"date + 6 month","date + 1 year","date + 2 years",null,"date + 6 month","date + 1 year","date + 2 years",{"$nulls":17},"date + 6 month","date + 1 year","date + 2 years",null,"date + 6 month","date + 1 year","date + 2 years",{"$nulls":13},"date + 6 month","date + 1 year","date + 2 years",{"$nulls":5},"date + 6 month","date + 1 year","date + 2 years",{"$nulls":17},"date + 6 month","date + 1 year","date + 2 years",{"$nulls":5},"date + 6 month","date + 1 year","date + 2 years",{"$nulls":5},"date + 6 month","date + 1 year","date + 2 years",null,"date + 6 month","date + 1 year","date + 2 years",null,null,"date + 6 month","date + 1 year","date + 2 years",null,"date + 6 month","date + 1 year","date + 2 years",null,"date + 6 month","date + 1 year","date + 2 years",null,"date + 6 month","date + 1 year","date + 2 years",null,"date + 6 month","date + 1 year","date + 2 years",null,"date + 6 month","date + 1 year","date + 2 years",null,"date + 6 month","date + 1 year","date + 2 years",null,"date + 6 month","date + 1 year","date + 2 years",null,"date + 6 month","date + 1 year","date + 2 years",null,"date + 6 month","date + 1 year","date + 2 years"]
[{"$nulls":10},{"$f":"(K8/N9)*15","v":12},{"$f":"(L8/N9)*15","v":12},{"$f":"(M8/N9)*15","v":12},null,{"$f":"(W8/Z9)*5+(AA8/AD9)*5+(AE8/AH9)*5+(AI8/AL9)*5","v":10.5},{"$f":"(X8/Z9)*5+(AB8/AD9)*5+(AF8/AH9)*5+(AJ8/AL9)*5","v":10.5},{"$f":"(Y8/Z9)*5+(AC8/AD9)*5+(AG8/AH9)*5+(AI8/AL9)*5","v":10.5},null,{"$f":"(O8/R9)*3+(S8/V9)*7+(AE8/AH9)*5+(AI8/AL9)*5","v":10.5},{"$f":"(P8/R9)*3+(T8/V9)*7+(AF8/AH9)*5+(AJ8/AL9)*5","v":10.5},{"$f":"(Q8/R9)*3+(U8/V9)*7+(AG8/AH9)*5+(AK8/AL9)*5","v":10.5},{"$nulls":17},{"$f":"(AM8/AP9)*2+(AQ8/AT9)*2+(AU8/AX9)*1+(AY8/BB9)*5+(BC8/BF9)*5","v":8.0090909090909097},{"$f":"(AN8/AP9)*2+(AR8/AT9)*2+(AV8/AX9)*1+(AZ8/BB9)*5+(BD8/BF9)*5","v":8.0090909090909097},{"$f":"(AO8/AP9)*2+(AS8/AT9)*2+(AW8/AX9)*1+(BA8/BB9)*5+(BE8/BF9)*5","v":8.0090909090909097},"Sur 15",{"$f":"(AM8/AP9)*4+(AQ8/AT9)*4+(AU8/AX9)*3+(AY8/BB9)*2+(BC8/BF9)*2","v":8.5636363636363644},{"$f":"(AN8/AP9)*4+(AR8/AT9)*4+(AV8/AX9)*3+(AZ8/BB9)*2+(BD8/BF9)*2","v":8.5636363636363644},{"$f":"(AO8/AP9)*4+(AS8/AT9)*4+(AW8/AX9)*3+(BA8/BB9)*2+(BE8/BF9)*2","v":8.5636363636363644},"Sur 15",{"$nulls":12},{"$f":"(BG8/BJ9)*2+(BK8/BN9)*2","v":0},{"$f":"(BH8/BJ9)*2+(BL8/BN9)*2","v":0},{"$f":"(BI8/BJ9)*2+(BM8/BN9)*2","v":0},"Sur",{"$f":"E79*2+E80*2","v":2},{"$f":"E79*2+E80*2","v":2},{"$f":"E79*2+E80*2","v":2},null,{"$f":"(BO8/BR9)*4+(BS8/BV9)*4+(BW8/BZ9)*4+(CA8/CD9)*4+(CE8/CH9)*4","v":16.333333333333332},{"$f":"(BP8/BR9)*4+(BT8/BV9)*4+(BX8/BZ9)*4+(CB8/CD9)*4+(CF8/CH9)*4","v":16.333333333333332},{"$f":"(BQ8/BR9)*4+(BU8/BV9)*4+(BY8/BZ9)*4+(CC8/CD9)*4+(CG8/CH9)*4","v":16.333333333333332},"Sur 20",{"$nulls":16},{"$f":"(CI8/CL9)*5+(CM8/CP9)*5","v":5.1190476190476186},{"$f":"(CJ8/CL9)*5+(CN8/CP9)*5","v":5.1190476190476186},{"$f":"(CK8/CL9)*5+(CO8/CP9)*5","v":5.1190476190476186},"Sur 10",{"$nulls":4},{"$f":"(CQ8/CT9)*5+(CU8/CX9)*5","v":3.8541666666666665},{"$f":"(CR8/CT9)*5+(CV8/CX9)*5","v":3.8541666666666665},{"$f":"(CS8/CT9)*5+(CW8/CX9)*5","v":3.8541666666666665},"Sur 10",{"$nulls":4},{"$f":"(CY8/DB9)*5+(DC8/DF9)*5","v":4.375},{"$f":"(CZ8/DB9)*5+(DD8/DF9)*5","v":4.375},{"$f":"(DA8/DB9)*5+(DE8/DF9)*5","v":4.375},"sur 10",{"$f":"(CY8/DB9)*3+(DC8/DF9)*3","v":2.625},{"$f":"(CZ8/DB9)*3+(DD8/DF9)*3","v":2.625},{"$f":"(DA8/DB9)*3+(DE8/DF9)*3","v":2.625},"Sur 6",null,{"$f":"DH6/DK6","v":0.71241830065359479},{"$f":"DI6/DK6","v":0.71241830065359479},{"$f":"DJ6/DK6","v":0.71241830065359479},null,{"$f":"DL6/DO6","v":0.41666666666666669},{"$f":"DM6/DO6","v":0.41666666666666669},{"$f":"DN6/DO6","v":0.41666666666666669},null,{"$f":"DP6/DS6","v":0.7},{"$f":"DQ6/DS6","v":0.7},{"$f":"DR6/DS6","v":0.7},null,{"$f":"DT6/DW6","v":0.25308641975308643},{"$f":"DU6/DW6","v":0.25308641975308643},{"$f":"DV6/DW6","v":0.25308641975308643},null,{"$f":"DX6/EA6","v":0.44252873563218392},{"$f":"DY6/EA6","v":0.44252873563218392},{"$f":"DZ6/EA6","v":0.44252873563218392},null,{"$f":"EB6/EE6","v":0.59399999999999997},{"$f":"EC6/EE6","v":0.59399999999999997},{"$f":"ED6/EE6","v":0.59399999999999997},null,{"$f":"EF6/EI6","v":0.51881720430107525},{"$f":"EG6/EI6","v":0.51881720430107525},{"$f":"EH6/EI6","v":0.51881720430107525},null,{"$f":"EJ6/EM6","v":0.56209150326797386},{"$f":"EK6/EM6","v":0.56209150326797386},{"$f":"EL6/EM6","v":0.56209150326797386},null,{"$f":"EN6/EQ6","v":0.6},{"$f":"EO6/EQ6","v":0.6},{"$f":"EP6/EQ6","v":0.6},null,{"$f":"ER6/EU6","v":0.671875},{"$f":"ES6/EU6","v":0.671875},{"$f":"ET6/EU6","v":0.671875}]
[{"$nulls":58},{"$f":"IF(BK4=0,1,BG4)","v":0},{"$f":"IF(BL4=0,1,BH4)","v":0},{"$f":"IF(BM4=0,1,BI4)","v":0},null,{"$f":"IF(BK4=0,1,BK4)","v":2},{"$f":"IF(BL4=0,1,BL4)","v":2},{"$f":"IF(BM4=0,1,BM4)","v":2},{"$nulls":46},"Total","Total","Total","Sur","Total","Total","Total","Sur","Total","Total","Total","Sur","Total","Total","Total","Sur","Total","Total","Total","Sur","Total","Total","Total","Sur","Total","Total","Total","Sur","Total","Total","Total","Sur","Total","Total","Total","Sur","Total","Total","Total","Sur"]
[null,"date + 6 month","date + 1 year","date + 2 years","total obtenable en comptant les NA",{"$nulls":9},"Reglementation de la déclaration",null,null,null,"Suspicions Exhaustivité",null,null,null,"Suspicions Exactitude",null,null,null,"Suspicions Précision",null,null,null,"Infections Exactitude",null,null,null,"Infections précision",null,null,null,"Action spécifique",null,null,null,"Entretien de sensibilisation",null,null,null,"Evaluation sensibilisation",null,null,null,"Modalités animation",null,null,null,"Adéquation temps imparti",null,null,null,"Surveillance de la faune sauvage",null,null,null,"Surveillance et contrôle des vecteurs",null,null,null,"Outils de mesure",null,null,null,"Prélèvements",null,null,null,"Analyses de laboratoire",null,null,null,"Contrôle des réactifs de laboratoire",null,null,null,"Laboratoires",null,null,null,"Standardisation enquêteurs",null,null,null,"Qual et délais de circ des données",null,null,null,"Qualité du traitement",null,null,null,"Validation scientifique",null,null,null,"Qualité de l'information diffusée",null,null,null,"Périodicité et champ de diffusion",{"$nulls":4},{"$f":"DH21*DK21+DH29*DK29+DH34*DK34+DH46*DK46+DH47*DK47+DH60*DK60+DH64*DK64+DH66*DK66+DH70*DK70+DH76*DK76+DH77*DK77+DH78*DK78+DH79*DK79+DH80*DK80+DH83*DK83+DH102*DK102+DH109*DK109+DH111*DK111+DH112*DK112+DH110*DK110","v":109},{"$f":"DI21*DK21+DI29*DK29+DI34*DK34+DI46*DK46+DI47*DK47+DI60*DK60+DI64*DK64+DI66*DK66+DI70*DK70+DI76*DK76+DI77*DK77+DI78*DK78+DI79*DK79+DI80*DK80+DI83*DK83+DI102*DK102+DI109*DK109+DI111*DK111+DI112*DK112+DI110*DK110","v":109},{"$f":"DJ21*DK21+DJ29*DK29+DJ34*DK34+DJ46*DK46+DJ47*DK47+DJ60*DK60+DJ64*DK64+DJ66*DK66+DJ70*DK70+DJ76*DK76+DJ77*DK77+DJ78*DK78+DJ79*DK79+DJ80*DK80+DJ83*DK83+DJ102*DK102+DJ109*DK109+DJ111*DK111+DJ112*DK112+DJ110*DK110","v":109},{"$f":"SUM(DK8:DK122)*3","v":153},{"$f":"DL48*DO48+DL61*DO61+DL77*DO77+DL100*DO100+DL102*DO102","v":15},{"$f":"DM48*DO48+DM61*DO61+DM77*DO77+DM100*DO100+DM102*DO102","v":15},{"$f":"DN48*DO48+DN61*DO61+DN77*DO77+DN100*DO100+DN102*DO102","v":15},{"$f":"SUM(DO8:DO122)*3","v":36},{"$f":"DP28*DS28+DP34*DS34+DP76*DS76+DP78*DS78+DP81*DS81+DP83*DS83","v":21},{"$f":"DQ28*DS28+DQ34*DS34+DQ76*DS76+DQ78*DS78+DQ81*DS81+DQ83*DS83","v":21},{"$f":"DR28*DS28+DR34*DS34+DR76*DS76+DR78*DS78+DR81*DS81+DR83*DS83","v":21},{"$f":"SUM(DS8:DS122)*3","v":30},{"$f":"DT32*DW32+DT35*DW35+DT41*DW41+DT45*DW45+DT50*DW50+DT51*DW51+DT88*DW88+DT89*DW89+DT90*DW90+DT112*DW112","v":20.5},{"$f":"DU32*DW32+DU35*DW35+DU41*DW41+DU45*DW45+DU50*DW50+DU51*DW51+DU88*DW88+DU89*DW89+DU90*DW90+DU112*DW112","v":20.5},{"$f":"DV32*DW32+DV35*DW35+DV41*DW41+DV45*DW45+DV50*DW50+DV51*DW51+DV88*DW88+DV89*DW89+DV90*DW90+DV112*DW112","v":20.5},{"$f":"SUM(DW8:DW122)*3","v":81},{"$f":"DX17*EA17+DX18*EA18+DX19*EA19+DX21*EA21+DX28*EA28+DX33*EA33+DX45*EA45+DX102*EA102+DX120*EA120+DX122*EA122","v":38.5},{"$f":"DY17*EA17+DY18*EA18+DY19*EA19+DY21*EA21+DY28*EA28+DY33*EA33+DY45*EA45+DY102*EA102+DY120*EA120+DY122*EA122","v":38.5},{"$f":"DZ17*EA17+DZ18*EA18+DZ19*EA19+DZ21*EA21+DZ28*EA28+DZ33*EA33+DZ45*EA45+DZ102*EA102+DZ120*EA120+DZ122*EA122","v":38.5},{"$f":"SUM(EA8:EA122)*3","v":87},{"$f":"EB11*EE11+EB31*EE31+EB44*EE44+EB52*EE52+EB91*EE91+EB103*EE103+EB12*EE12+EB19*EE19+EB22*EE22+EB28*EE28+EB29*EE29+EB30*EE30+EB32*EE32+EB33*EE33+EB35*EE35+EB40*EE40+EB41*EE41+EB42*EE42+EB43*EE43+EB45*EE45+EB46*EE46+EB47*EE47+EB48*EE48+EB49*EE49+EB50*EE50+EB51*EE51+EB57*EE57+EB58*EE58+EB59*EE59+EB63*EE63+EB64*EE64+EB65*EE65+EB66*EE66+EB75*EE75+EB81*EE81+EB82*EE82+EB83*EE83+EB88*EE88+EB90*EE90+EB92*EE92+EB94*EE94+EB99*EE99+EB100*EE100+EB101*EE101+EB119*EE119+EB120*EE120+EB121*EE121+EB122*EE122","v":222.75},{"$f":"EC11*EE11+EC31*EE31+EC44*EE44+EC52*EE52+EC91*EE91+EC103*EE103+EC12*EE12+EC19*EE19+EC22*EE22+EC28*EE28+EC29*EE29+EC30*EE30+EC32*EE32+EC33*EE33+EC35*EE35+EC40*EE40+EC41*EE41+EC42*EE42+EC43*EE43+EC45*EE45+EC46*EE46+EC47*EE47+EC48*EE48+EC49*EE49+EC50*EE50+EC51*EE51+EC57*EE57+EC58*EE58+EC59*EE59+EC63*EE63+EC64*EE64+EC65*EE65+EC66*EE66+EC75*EE75+EC81*EE81+EC82*EE82+EC83*EE83+EC88*EE88+EC90*EE90+EC92*EE92+EC94*EE94+EC99*EE99+EC100*EE100+EC101*EE101+EC119*EE119+EC120*EE120+EC121*EE121+EC122*EE122","v":222.75},{"$f":"ED11*EE11+ED31*EE31+ED44*EE44+ED52*EE52+ED91*EE91+ED103*EE103+ED12*EE12+ED19*EE19+ED22*EE22+ED28*EE28+ED29*EE29+ED30*EE30+ED32*EE32+ED33*EE33+ED35*EE35+ED40*EE40+ED41*EE41+ED42*EE42+ED43*EE43+ED45*EE45+ED46*EE46+ED47*EE47+ED48*EE48+ED49*EE49+ED50*EE50+ED51*EE51+ED57*EE57+ED58*EE58+ED59*EE59+ED63*EE63+ED64*EE64+ED65*EE65+ED66*EE66+ED75*EE75+ED81*EE81+ED82*EE82+ED83*EE83+ED88*EE88+ED90*EE90+ED92*EE92+ED94*EE94+ED99*EE99+ED100*EE100+ED101*EE101+ED119*EE119+ED120*EE120+ED121*EE121+ED122*EE122","v":222.75},{"$f":"SUM(EE8:EE122)*3","v":375},{"$f":"EF13*EI13+EF23*EI23+EF17*EI17+EF18*EI18+EF19*EI19+EF20*EI20+EF28*EI28+EF31*EI31+EF44*EI44+EF91*EI91+EF103*EI103+EF114*EI114+EF32*EI32+EF35*EI35+EF41*EI41+EF42*EI42+EF43*EI43+EF49*EI49+EF57*EI57+EF58*EI58+EF88*EI88+EF108*EI108+EF111*EI111+EF109*EI109","v":96.5},{"$f":"EG13*EI13+EG23*EI23+EG17*EI17+EG18*EI18+EG19*EI19+EG20*EI20+EG28*EI28+EG31*EI31+EG44*EI44+EG91*EI91+EG103*EI103+EG114*EI114+EG32*EI32+EG35*EI35+EG41*EI41+EG42*EI42+EG43*EI43+EG49*EI49+EG57*EI57+EG58*EI58+EG88*EI88+EG108*EI108+EG111*EI111+EG109*EI109","v":96.5},{"$f":"EH13*EI13+EH23*EI23+EH17*EI17+EH18*EI18+EH19*EI19+EH20*EI20+EH28*EI28+EH31*EI31+EH44*EI44+EH91*EI91+EH103*EI103+EH114*EI114+EH32*EI32+EH35*EI35+EH41*EI41+EH42*EI42+EH43*EI43+EH49*EI49+EH57*EI57+EH58*EI58+EH88*EI88+EH108*EI108+EH111*EI111+EH109*EI109","v":96.5},{"$f":"SUM(EI8:EI122)*3","v":186},{"$f":"EJ13*EM13+EJ17*EM17+EJ18*EM18+EJ20*EM20+EJ21*EM21+EJ29*EM29+EJ32*EM32+EJ33*EM33+EJ35*EM35+EJ40*EM40+EJ62*EM62+EJ68*EM68+EJ69*EM69+EJ77*EM77+EJ88*EM88+EJ100*EM100+EJ108*EM108+EJ111*EM111+EJ109*EM109","v":86},{"$f":"EK13*EM13+EK17*EM17+EK18*EM18+EK20*EM20+EK21*EM21+EK29*EM29+EK32*EM32+EK33*EM33+EK35*EM35+EK40*EM40+EK62*EM62+EK68*EM68+EK69*EM69+EK77*EM77+EK88*EM88+EK100*EM100+EK108*EM108+EK111*EM111+EK109*EM109","v":86},{"$f":"EL13*EM13+EL17*EM17+EL18*EM18+EL20*EM20+EL21*EM21+EL29*EM29+EL32*EM32+EL33*EM33+EL35*EM35+EL40*EM40+EL62*EM62+EL68*EM68+EL69*EM69+EL77*EM77+EL88*EM88+EL100*EM100+EL108*EM108+EL111*EM111+EL109*EM109","v":86},{"$f":"SUM(EM8:EM122)*3","v":153},{"$f":"EN17*EQ17+EN50*EQ50+EN62*EQ62+EN68*EQ68+EN69*EQ69+EN88*EQ88+EN100*EQ100","v":36},{"$f":"EO17*EQ17+EO50*EQ50+EO62*EQ62+EO68*EQ68+EO69*EQ69+EO88*EQ88+EO100*EQ100","v":36},{"$f":"EP17*EQ17+EP50*EQ50+EP62*EQ62+EP68*EQ68+EP69*EQ69+EP88*EQ88+EP100*EQ100","v":36},{"$f":"SUM(EQ8:EQ122)*3","v":60},{"$f":"ER11*EU11+ER13*EU13+ER14*EU14+ER20*EU20+ER31*EU31+ER64*EU64+ER75*EU75+ER93*EU93+ER94*EU94+ER88*EU88+ER111*EU111+ER113*EU113+ER110*EU110","v":64.5},{"$f":"ES11*EU11+ES13*EU13+ES14*EU14+ES20*EU20+ES31*EU31+ES64*EU64+ES75*EU75+ES93*EU93+ES94*EU94+ES88*EU88+ES111*EU111+ES113*EU113+ES110*EU110","v":64.5},{"$f":"ET11*EU11+ET13*EU13+ET14*EU14+ET20*EU20+ET31*E31+ET64*EU64+ET75*EU75+ET93*EU93+ET94*EU94+ET88*EU88+ET111*EU111+ET113*EU113+ET110*EU110","v":64.5},{"$f":"SUM(EU8:EU122)*3","v":96}]
[null,"Note (sur 3)",{"$nulls":8},"Total","Total","Total","Sur","Total","Total","Total","Sur","Total","Total","Total","Sur","Total","Total","Total","Sur","Total","Total","Total","Sur","Total","Total","Total","Sur","Total","Total","Total","Sur","Total","Total","Total","Sur","Total","Total","Total","Sur","Total","Total","Total","Sur","Total","Total","Total","Sur","Total","Total","Total","Sur","Total","Total","Total","Sur","Total","Total","Total","Sur","Total","Total","Total","Sur","Total","Total","Total","Sur","Total","Total","Total","Sur","Total","Total","Total","Sur","Total","Total","Total","Sur","Total","Total","Total","Sur","Total","Total","Total","Sur","Total","Total","Total","Sur","Total","Total","Total","Sur","Total","Total","Total","Sur","Total","Total","Total","Sur",null,"Note","Note","Note","Coeff.","Note","Note","Note","Coeff.","Note","Note","Note","Coeff.","Note","Note","Note","Coeff.","Note","Note","Note","Coeff.","Note","Note","Note","Coeff.","Note","Note","Note","Coeff.","Note","Note","Note","Coeff.","Note","Note","Note","Coeff.","Note","Note","Note","Coeff."]
[null,"NA=Not Applicable",{"$nulls":6},"missing points",null,{"$f":"SUM(K11:K122)","v":12},{"$f":"SUM(L11:L122)","v":12},{"$f":"SUM(M11:M122)","v":12},{"$f":"(E11+E12+E13+E14+E75)*3","v":15},{"$f":"SUM(O11:O122)","v":0},{"$f":"SUM(P11:P122)","v":0},{"$f":"SUM(Q11:Q122)","v":0},{"$f":"E20*3","v":3},{"$f":"SUM(S11:S122)","v":15},{"$f":"SUM(T11:T122)","v":15},{"$f":"SUM(U11:U122)","v":15},{"$f":"(E34+E76*4+E78)*3","v":18},{"$f":"SUM(W11:W122)","v":15},{"$f":"SUM(X11:X122)","v":15},{"$f":"SUM(Y11:Y122)","v":15},{"$f":"(E34+E76*4+E78+E81+E83)*3","v":18},{"$f":"SUM(AA11:AA122)","v":1},{"$f":"SUM(AB11:AB122)","v":1},{"$f":"SUM(AC11:AC122)","v":1},{"$f":"(E78+E82+E83)*3","v":3},{"$f":"SUM(AE11:AE122)","v":14},{"$f":"SUM(AF11:AF122)","v":14},{"$f":"SUM(AG11:AG122)","v":14},{"$f":"(E28+E34+E76*3+E81)*3","v":15},{"$f":"SUM(AI11:AI122)","v":0},{"$f":"SUM(AJ11:AJ122)","v":0},{"$f":"SUM(AK11:AK122)","v":0},{"$f":"E82*3","v":0},{"$f":"SUM(AM11:AM122)","v":3},{"$f":"SUM(AN11:AN122)","v":3},{"$f":"SUM(AO11:AO122)","v":3},{"$f":"(E77+E100)*3","v":6},{"$f":"SUM(AQ11:AQ122)","v":9.5},{"$f":"SUM(AR11:AR122)","v":9.5},{"$f":"SUM(AS11:AS122)","v":9.5},{"$f":"(E40+E77+E102+E111+E110)*3","v":15},{"$f":"SUM(AU11:AU122)","v":2},{"$f":"SUM(AV11:AV122)","v":2},{"$f":"SUM(AW11:AW122)","v":2},{"$f":"E77*3","v":3},{"$f":"SUM(AY11:AY122)","v":19.75},{"$f":"SUM(AZ11:AZ122)","v":19.75},{"$f":"SUM(BA11:BA122)","v":19.75},{"$f":"(E18+E21+E22+E28+E29+E30+E31+E33+E45+E90+E99)*3","v":33},{"$f":"SUM(BC11:BC122)","v":2.5},{"$f":"SUM(BD11:BD122)","v":2.5},{"$f":"SUM(BE11:BE122)","v":2.5},{"$f":"(E17+E19)*3","v":6},{"$f":"SUM(BG11:BG122)","v":0},{"$f":"SUM(BH11:BH122)","v":0},{"$f":"SUM(BI11:BI122)","v":0},{"$f":"E79*3","v":3},{"$f":"SUM(BK11:BK122)","v":0},{"$f":"SUM(BL11:BL122)","v":0},{"$f":"SUM(BM11:BM122)","v":0},{"$f":"E80*3","v":0},{"$f":"SUM(BO11:BO122)","v":16},{"$f":"SUM(BP11:BP122)","v":16},{"$f":"SUM(BQ11:BQ122)","v":16},{"$f":"(E58+E59+E60+E61+E62+E100+E101+E102)*3","v":24},{"$f":"SUM(BS11:BS122)","v":14},{"$f":"SUM(BT11:BT122)","v":14},{"$f":"SUM(BU11:BU122)","v":14},{"$f":"(E57+E64+E65+E66+E100+E101+E102)*3","v":21},{"$f":"SUM(BW11:BW122)","v":9},{"$f":"SUM(BX11:BX122)","v":9},{"$f":"SUM(BY11:BY122)","v":9},{"$f":"(E40+E46+E47+E48)*3","v":12},{"$f":"SUM(CA11:CA122)","v":3},{"$f":"SUM(CB11:CB122)","v":3},{"$f":"SUM(CC11:CC122)","v":3},{"$f":"E49*3","v":3},{"$f":"SUM(CE11:CE122)","v":12},{"$f":"SUM(CF11:CF122)","v":12},{"$f":"SUM(CG11:CG122)","v":12},{"$f":"(E42+E43+E44+E52)*3","v":12},{"$f":"SUM(CI11:CI122)","v":12},{"$f":"SUM(CJ11:CJ122)","v":12},{"$f":"SUM(CK11:CK122)","v":12},{"$f":"(E17+E31+E33+E63+E66+E100+E101+E102)*3","v":24},{"$f":"SUM(CM11:CM122)","v":11},{"$f":"SUM(CN11:CN122)","v":11},{"$f":"SUM(CO11:CO122)","v":11},{"$f":"(E41+E51+E67+E68+E89+E109+E112)*3","v":21},{"$f":"SUM(CQ11:CQ122)","v":10.5},{"$f":"SUM(CR11:CR122)","v":10.5},{"$f":"SUM(CS11:CS122)","v":10.5},{"$f":"(E41+E50+E51+E88+E90+E92+E93+E99)*3","v":24},{"$f":"SUM(CU11:CU122)","v":3},{"$f":"SUM(CV11:CV122)","v":3},{"$f":"SUM(CW11:CW122)","v":3},{"$f":"(E19+E94+E99)*3","v":9},{"$f":"SUM(CY11:CY122)","v":1.5},{"$f":"SUM(CZ11:CZ122)","v":1.5},{"$f":"SUM(DA11:DA122)","v":1.5},{"$f":"(E108+E110)*3","v":6},{"$f":"SUM(DC11:DC122)","v":7.5},{"$f":"SUM(DD11:DD122)","v":7.5},{"$f":"SUM(DE11:DE122)","v":7.5},{"$f":"(E108+E111+E113+E110)*3","v":12}]
[{"$nulls":13},{"$f":"IF(N8=0,1,N8)","v":15},null,null,null,{"$f":"IF(R8=0,1,R8)","v":3},null,null,null,{"$f":"IF(V8=0,1,V8)","v":18},null,null,null,{"$f":"IF(Z8=0,1,Z8)","v":18},null,null,null,{"$f":"IF(AD8=0,1,AD8)","v":3},null,null,null,{"$f":"IF(AH8=0,1,AH8)","v":15},null,null,null,{"$f":"IF(AL8=0,1,AL8)","v":1},null,null,null,{"$f":"IF(AP8=0,1,AP8)","v":6},null,null,null,{"$f":"IF(AT8=0,1,AT8)","v":15},null,null,null,{"$f":"IF(AX8=0,1,AX8)","v":3},null,null,null,{"$f":"IF(BB8=0,1,BB8)","v":33},null,null,null,{"$f":"IF(BF8=0,1,BF8)","v":6},null,null,null,{"$f":"IF(BJ8=0,1,BJ8)","v":3},null,null,null,{"$f":"IF(BN8=0,1,BN8)","v":1},null,null,null,{"$f":"IF(BR8=0,1,BR8)","v":24},null,null,null,{"$f":"IF(BV8=0,1,BV8)","v":21},null,null,null,{"$f":"IF(BZ8=0,1,BZ8)","v":12},null,null,null,{"$f":"IF(CD8=0,1,CD8)","v":3},null,null,null,{"$f":"IF(CH8=0,1,CH8)","v":12},null,null,null,{"$f":"IF(CL8=0,1,CL8)","v":24},null,null,null,{"$f":"IF(CP8=0,1,CP8)","v":21},null,null,null,{"$f":"IF(CT8=0,1,CT8)","v":24},null,null,null,{"$f":"IF(CX8=0,1,CX8)","v":9},null,null,null,{"$f":"IF(DB8=0,1,DB8)","v":6},null,null,null,{"$f":"IF(DF8=0,1,DF8)","v":12}]
[{"$f":"'[1]Scoring criteria'!A14","v":"Section 1: Objectives and context of surveillance"}]
["1.A.           Relevance of surveillance objectives",{"$f":"'Scoring criteria'!E15","v":3},{"$f":"B11","v":3},3,{"$f":"IF(OR(B11=\"SO\",B11=\"NA\"),0,1)","v":1},{"$nulls":5},{"$f":"B11","v":3},3,3,{"$nulls":118},{"$f":"SUM(B11)","v":3},3,3,{"$f":"E11*3","v":3},{"$nulls":12},{"$f":"SUM(B11)","v":3},{"$f":"SUM(C11)","v":3},{"$f":"SUM(D11)","v":3},{"$f":"E11*3","v":3}]
["1.B.           Level of detail, accuracy, and formalization of objectives",{"$f":"'Scoring criteria'!E16","v":3},3,3,{"$f":"IF(OR(B12=\"SO\",B12=\"NA\"),0,1)","v":1},{"$nulls":5},3,3,3,{"$nulls":118},3,3,3,{"$f":"E12*3","v":3}]
["1.C.           Taking partners’ expectations into account",{"$f":"'Scoring criteria'!E17","v":3},3,3,{"$f":"IF(OR(B13=\"SO\",B13=\"NA\"),0,1)","v":1},{"$nulls":5},3,3,3,{"$nulls":122},{"$f":"SUM(B13)","v":3},{"$f":"SUM(C13)","v":3},{"$f":"SUM(D13)","v":3},{"$f":"E13*3","v":3},{"$f":"SUM(B13)","v":3},{"$f":"SUM(C13)","v":3},{"$f":"SUM(D13)","v":3},{"$f":"E13*3","v":3},{"$nulls":4},{"$f":"SUM(B13)","v":3},3,3,{"$f":"E13*3","v":3}]
["1.D.           Coherence of the diseases under surveillance with the sanitary situation (existing/exotic diseases or threats)",{"$f":"'Scoring criteria'!E18","v":3},3,3,{"$f":"IF(OR(B14=\"SO\",B14=\"NA\"),0,1)","v":1},{"$nulls":5},3,3,3,{"$nulls":134},3,3,3,{"$f":"E14*3","v":3}]
[null,{"$f":"SUM(B11:B14)","v":12},12,12,{"$f":"SUM(E11:E14)*3","v":12},null,{"$f":"B15/E15","v":1},{"$f":"B15","v":12},{"$f":"E15-B15","v":0}]
["Section 2: Central institutional organization"]
["2.A. Existence of an operational management structure (central unit)",{"$f":"IF('Scoring criteria'!E24<> \"NA\",'Scoring criteria'!E24-'Scoring criteria'!E24*financial!B11,'Scoring criteria'!E24)","v":0.5},{"$f":"IF('Scoring criteria'!E24<> \"NA\",'Scoring criteria'!E24-'Scoring criteria'!E24*financial!D11,'Scoring criteria'!E24)","v":0.5},{"$f":"IF('Scoring criteria'!E24<> \"NA\",'Scoring criteria'!E24-'Scoring criteria'!E24*financial!F11,'Scoring criteria'!E24)","v":0.5},{"$f":"IF(OR(B17=\"SO\",B17=\"NA\"),0,1)","v":1},{"$nulls":49},{"$f":"B17","v":0.5},{"$f":"C17","v":0.5},{"$f":"D17","v":0.5},{"$nulls":29},{"$f":"B17","v":0.5},{"$f":"C17","v":0.5},{"$f":"D17","v":0.5},{"$nulls":38},{"$f":"SUM(B17)","v":0.5},0.5,0.5,{"$f":"E17*3","v":3},{"$nulls":4},{"$f":"SUM(B17)","v":0.5},0.5,0.5,{"$f":"E17*3","v":3},{"$f":"SUM(B17)","v":0.5},0.5,0.5,{"$f":"E17*3","v":3},{"$f":"SUM(B17)","v":0.5},{"$f":"SUM(C17)","v":0.5},{"$f":"SUM(D17)","v":0.5},{"$f":"E17*3","v":3}]
["2.B Existence of an operational steering structure that is representative of the partners (steering committee)",{"$f":"IF('Scoring criteria'!E25<> \"NA\",'Scoring criteria'!E25-'Scoring criteria'!E25*financial!B11,'Scoring criteria'!E25)","v":1},{"$f":"IF('Scoring criteria'!E25<> \"NA\",'Scoring criteria'!E25-'Scoring criteria'!E25*financial!D11,'Scoring criteria'!E25)","v":1},{"$f":"IF('Scoring criteria'!E25<> \"NA\",'Scoring criteria'!E25-'Scoring criteria'!E25*financial!F11,'Scoring criteria'!E25)","v":1},1,{"$nulls":45},{"$f":"B18","v":1},{"$f":"C18","v":1},{"$f":"D18","v":1},{"$nulls":74},1,1,1,{"$f":"E18*3","v":3},{"$nulls":4},1,1,1,{"$f":"E18*3","v":3},1,1,1,{"$f":"E18*3","v":3}]
["2.C. Existence of a scientific and technical committee for the system",{"$f":"IF('Scoring criteria'!E26<> \"NA\",'Scoring criteria'!E26-'Scoring criteria'!E26*financial!B11,'Scoring criteria'!E26)","v":2},{"$f":"IF('Scoring criteria'!E26<> \"NA\",'Scoring criteria'!E26-'Scoring criteria'!E26*financial!D11,'Scoring criteria'!E26)","v":2},{"$f":"IF('Scoring criteria'!E26<> \"NA\",'Scoring criteria'!E26-'Scoring criteria'!E26*financial!F11,'Scoring criteria'!E26)","v":2},1,{"$nulls":49},{"$f":"B19","v":2},{"$f":"C19","v":2},{"$f":"D19","v":2},{"$nulls":41},{"$f":"B19","v":2},{"$f":"C19","v":2},{"$f":"D19","v":2},{"$nulls":26},2,2,2,{"$f":"E19*3","v":3},{"$f":"SUM(B19)","v":2},{"$f":"SUM(C19)","v":2},{"$f":"SUM(D19)","v":2},{"$f":"E19*3","v":3},2,2,2,{"$f":"E19*3","v":3}]
["2.D. Organization and operations of the system laid down in regulations, a charter, or a convention established between the partners",{"$f":"'Scoring criteria'!E27","v":0},{"$f":"$B$20","v":0},{"$f":"$B$20","v":0},1,{"$nulls":9},{"$f":"B20","v":0},{"$f":"C20","v":0},{"$f":"D20","v":0},{"$nulls":118},0,0,0,{"$f":"E20*3","v":3},{"$f":"SUM(B20)","v":0},0,0,{"$f":"E20*3","v":3},{"$nulls":4},{"$f":"SUM(B20)","v":0},{"$f":"SUM(C20)","v":0},{"$f":"SUM(D20)","v":0},{"$f":"E20*1","v":1}]
["2.E. Frequency of meetings of the central coordinating body",{"$f":"IF('Scoring criteria'!E28<> \"NA\",'Scoring criteria'!E28-'Scoring criteria'!E28*financial!B11,'Scoring criteria'!E28)","v":2},{"$f":"IF('Scoring criteria'!E28<> \"NA\",'Scoring criteria'!E28-'Scoring criteria'!E28*financial!D11,'Scoring criteria'!E28)","v":2},{"$f":"IF('Scoring criteria'!E28<> \"NA\",'Scoring criteria'!E28-'Scoring criteria'!E28*financial!F11,'Scoring criteria'!E28)","v":2},1,{"$nulls":45},{"$f":"B21","v":2},2,2,{"$nulls":58},{"$f":"SUM(B21)","v":2},{"$f":"SUM(C21)","v":2},{"$f":"SUM(D21)","v":2},{"$f":"E21*2","v":2},{"$nulls":12},{"$f":"SUM(B21)","v":2},{"$f":"SUM(C21)","v":2},{"$f":"SUM(D21)","v":2},{"$f":"E21*3","v":3},{"$nulls":8},2,2,2,{"$f":"E21*2","v":2}]
["2.F. Supervision of intermediary units by the central level",{"$f":"IF('Scoring criteria'!E29<> \"NA\",'Scoring criteria'!E29-'Scoring criteria'!E29*financial!B11,'Scoring criteria'!E29)","v":2},{"$f":"IF('Scoring criteria'!E29<> \"NA\",'Scoring criteria'!E29-'Scoring criteria'!E29*financial!D11,'Scoring criteria'!E29)","v":2},{"$f":"IF('Scoring criteria'!E29<> \"NA\",'Scoring criteria'!E29-'Scoring criteria'!E29*financial!F11,'Scoring criteria'!E29)","v":2},1,{"$nulls":45},2,2,2,{"$nulls":78},{"$f":"SUM(B22)","v":2},{"$f":"SUM(C22)","v":2},{"$f":"SUM(D22)","v":2},{"$f":"E22*3","v":3}]
["2.G. Adequacy of the central level’s material and financial resources  \n \n",{"$f":"IF('Scoring criteria'!E30<> \"NA\",'Scoring criteria'!E30-'Scoring criteria'!E30*financial!B17,'Scoring criteria'!E30)","v":0},{"$f":"IF('Scoring criteria'!E30<> \"NA\",'Scoring criteria'!E30-'Scoring criteria'!E30*financial!D11,'Scoring criteria'!E30)","v":0},{"$f":"IF('Scoring criteria'!E30<> \"NA\",'Scoring criteria'!E30-'Scoring criteria'!E30*financial!F11,'Scoring criteria'!E30)","v":0},1,{"$nulls":130},{"$f":"SUM(B23)","v":0},{"$f":"SUM(C23)","v":0},{"$f":"SUM(D23)","v":0},{"$f":"E23*3","v":3}]
[null,{"$f":"SUM(B17:B23)","v":7.5},{"$f":"SUM(C17:C23)","v":7.5},{"$f":"SUM(D17:D23)","v":7.5},{"$f":"SUM(E17:E23)*3","v":21},"date + 6 months",{"$f":"B24/E24","v":0.35714285714285715},{"$f":"B24","v":7.5},{"$f":"E24-B24","v":13.5}]
[{"$nulls":5},"date + 1 year",{"$f":"C24/E24","v":0.35714285714285715},{"$f":"C24","v":7.5},{"$f":"E24-C24","v":13.5}]
[{"$nulls":5},"date +2 years",{"$f":"D24/E24","v":0.35714285714285715},{"$f":"D24","v":7.5},{"$f":"E24-D24","v":13.5}]
["Section 3: Field institutional organization"]
["3.A. Existence of formal intermediary units covering the entire territory",{"$f":"'Scoring criteria'!E36","v":3},{"$f":"B28","v":3},{"$f":"C28","v":3},{"$f":"IF(OR(B28=\"SO\",B28=\"NA\"),0,1)","v":1},{"$nulls":25},{"$f":"B28","v":3},{"$f":"C28","v":3},{"$f":"D28","v":3},{"$nulls":17},{"$f":"B28","v":3},3,3,{"$nulls":66},{"$f":"SUM(B28)","v":3},{"$f":"SUM(C28)","v":3},{"$f":"SUM(D28)","v":3},{"$f":"E28*1","v":1},{"$nulls":4},{"$f":"SUM(B28)","v":3},{"$f":"SUM(C28)","v":3},{"$f":"SUM(D28)","v":3},{"$f":"E28*3","v":3},{"$f":"SUM(B28)","v":3},3,3,{"$f":"E28*2","v":2},{"$f":"SUM(B28)","v":3},{"$f":"SUM(C28)","v":3},{"$f":"SUM(D28)","v":3},{"$f":"E28*2","v":2}]
["3.B. Active role of intermediary units in the functioning of the system (validation, management, feedback)",{"$f":"IF('Scoring criteria'!E37<> \"NA\",'Scoring criteria'!E37-'Scoring criteria'!E37*financial!B16,'Scoring criteria'!E37)","v":3},{"$f":"IF('Scoring criteria'!E37<> \"NA\",'Scoring criteria'!E37-'Scoring criteria'!E37*financial!D16,'Scoring criteria'!E37)","v":3},{"$f":"IF('Scoring criteria'!E37<> \"NA\",'Scoring criteria'!E37-'Scoring criteria'!E37*financial!F16,'Scoring criteria'!E37)","v":3},1,{"$nulls":45},3,3,3,{"$nulls":58},{"$f":"SUM(B29)","v":3},{"$f":"SUM(C29)","v":3},{"$f":"SUM(D29)","v":3},{"$f":"E29*1","v":1},{"$nulls":16},3,3,3,{"$f":"E29*2","v":2},{"$nulls":4},{"$f":"SUM(B29)","v":3},{"$f":"SUM(C29)","v":3},{"$f":"SUM(D29)","v":3},{"$f":"E29*2","v":2}]
["3.C. Implementation of supervision by the intermediary level\n",{"$f":"IF('Scoring criteria'!E38<> \"NA\",'Scoring criteria'!E38-'Scoring criteria'!E38*financial!B16,'Scoring criteria'!E38)","v":2.75},{"$f":"IF('Scoring criteria'!E38<> \"NA\",'Scoring criteria'!E38-'Scoring criteria'!E38*financial!D16,'Scoring criteria'!E38)","v":2.75},{"$f":"IF('Scoring criteria'!E38<> \"NA\",'Scoring criteria'!E38-'Scoring criteria'!E38*financial!F16,'Scoring criteria'!E38)","v":2.75},1,{"$nulls":45},2.75,2.75,2.75,{"$nulls":78},2.75,2.75,2.75,{"$f":"E30*3","v":3}]
["3.D. Harmonization of intermediary units’ activities",{"$f":"'Scoring criteria'!E39","v":0},{"$f":"B31","v":0},{"$f":"C31","v":0},1,{"$nulls":45},0,0,0,{"$nulls":33},{"$f":"B31","v":0},{"$f":"C31","v":0},{"$f":"D31","v":0},{"$nulls":42},0,0,0,{"$f":"E31*3","v":3},{"$f":"SUM(B31)","v":0},0,0,{"$f":"E31*2","v":2},{"$nulls":8},{"$f":"SUM(B31)","v":0},{"$f":"SUM(C31)","v":0},{"$f":"SUM(D31)","v":0},{"$f":"E31*2","v":2}]
["3.E. Adequacy of material and financial resources of intermediary units ",{"$f":"IF('Scoring criteria'!E40<> \"NA\",'Scoring criteria'!E40-'Scoring criteria'!E40*financial!B16,'Scoring criteria'!E40)","v":0},{"$f":"IF('Scoring criteria'!E40<> \"NA\",'Scoring criteria'!E40-'Scoring criteria'!E40*financial!D16,'Scoring criteria'!E40)","v":0},{"$f":"IF('Scoring criteria'!E40<> \"NA\",'Scoring criteria'!E40-'Scoring criteria'!E40*financial!F16,'Scoring criteria'!E40)","v":0},1,{"$nulls":118},{"$f":"SUM(B32)","v":0},{"$f":"SUM(C32)","v":0},{"$f":"SUM(D32)","v":0},{"$f":"E32*3","v":3},{"$nulls":4},0,0,0,{"$f":"E32*3","v":3},0,0,0,{"$f":"E32*2","v":2},{"$f":"SUM(B32)","v":0},0,0,{"$f":"E32*2","v":2}]
["3.F. Existence of coordination meetings at the intermediate level",{"$f":"IF('Scoring criteria'!E41<> \"NA\",'Scoring criteria'!E41-'Scoring criteria'!E41*financial!B16,'Scoring criteria'!E41)","v":2},{"$f":"IF('Scoring criteria'!E41<> \"NA\",'Scoring criteria'!E41-'Scoring criteria'!E41*financial!D16,'Scoring criteria'!E41)","v":2},{"$f":"IF('Scoring criteria'!E41<> \"NA\",'Scoring criteria'!E41-'Scoring criteria'!E41*financial!F16,'Scoring criteria'!E41)","v":2},1,{"$nulls":45},{"$f":"B33","v":2},{"$f":"C33","v":2},{"$f":"D33","v":2},{"$nulls":33},{"$f":"B33","v":2},{"$f":"C33","v":2},{"$f":"D33","v":2},{"$nulls":38},{"$f":"SUM(B33)","v":2},{"$f":"SUM(C33)","v":2},{"$f":"SUM(D33)","v":2},{"$f":"E33*3","v":3},2,2,2,{"$f":"E33*1","v":1},{"$nulls":4},2,2,2,{"$f":"E33*2","v":2}]
["3.G. Exhaustiveness or representativeness of the field agents’ coverage of the target population",{"$f":"IF('Scoring criteria'!E42<> \"NA\",'Scoring criteria'!E42-'Scoring criteria'!E42*financial!B16,'Scoring criteria'!E42)","v":2},{"$f":"IF('Scoring criteria'!E42<> \"NA\",'Scoring criteria'!E42-'Scoring criteria'!E42*financial!D16,'Scoring criteria'!E42)","v":2},{"$f":"IF('Scoring criteria'!E42<> \"NA\",'Scoring criteria'!E42-'Scoring criteria'!E42*financial!F16,'Scoring criteria'!E42)","v":2},1,{"$nulls":13},{"$f":"B34","v":2},{"$f":"C34","v":2},{"$f":"D34","v":2},null,{"$f":"B34","v":2},{"$f":"C34","v":2},{"$f":"D34","v":2},{"$nulls":5},{"$f":"B34","v":2},{"$f":"C34","v":2},{"$f":"D34","v":2},{"$nulls":78},{"$f":"SUM(B34)","v":2},{"$f":"SUM(C34)","v":2},{"$f":"SUM(D34)","v":2},{"$f":"E34*3","v":3},{"$nulls":4},{"$f":"SUM(B34)","v":2},{"$f":"SUM(C34)","v":2},{"$f":"SUM(D34)","v":2},{"$f":"E34*3","v":3}]
["3.H. Adequacy of material and financial resources at the field level ",{"$f":"IF('Scoring criteria'!E43<> \"NA\",'Scoring criteria'!E43-'Scoring criteria'!E43*financial!B16,'Scoring criteria'!E43)","v":0},{"$f":"IF('Scoring criteria'!E43<> \"NA\",'Scoring criteria'!E43-'Scoring criteria'!E43*financial!D16,'Scoring criteria'!E43)","v":0},{"$f":"IF('Scoring criteria'!E43<> \"NA\",'Scoring criteria'!E43-'Scoring criteria'!E43*financial!F16,'Scoring criteria'!E43)","v":0},1,{"$nulls":118},{"$f":"SUM(B35)","v":0},{"$f":"SUM(C35)","v":0},{"$f":"SUM(D35)","v":0},{"$f":"E35*3","v":3},{"$nulls":4},{"$f":"SUM(B35)","v":0},{"$f":"SUM(C35)","v":0},{"$f":"SUM(D35)","v":0},{"$f":"E35*3","v":3},{"$f":"SUM(B35)","v":0},{"$f":"SUM(C35)","v":0},{"$f":"SUM(D35)","v":0},{"$f":"E35*3","v":3},{"$f":"SUM(B35)","v":0},{"$f":"SUM(C35)","v":0},{"$f":"SUM(D35)","v":0},{"$f":"E35*3","v":3}]
[null,{"$f":"SUM(B28:B35)","v":12.75},{"$f":"SUM(C28:C35)","v":12.75},{"$f":"SUM(D28:D35)","v":12.75},{"$f":"SUM(E28:E35)*3","v":24},"date + 6 months",{"$f":"B36/E36","v":0.53125},{"$f":"B36","v":12.75},{"$f":"E36-B36","v":11.25}]
[{"$nulls":5},"date + 1 year",{"$f":"C36/E36","v":0.53125},{"$f":"C36","v":12.75},{"$f":"E36-C36","v":11.25}]
[{"$nulls":5},"date +2 years",{"$f":"D36/E36","v":0.53125},{"$f":"D36","v":12.75},{"$f":"E36-D36","v":11.25}]
["Section 4 : Laboratory"]
["4.A. Effective integration of laboratories in the surveillance system",{"$f":"'Scoring criteria'!E49","v":3},{"$f":"B40","v":3},{"$f":"C40","v":3},{"$f":"IF(OR(B40=\"SO\",B40=\"NA\"),0,1)","v":1},{"$nulls":37},{"$f":"B40","v":3},{"$f":"C40","v":3},{"$f":"D40","v":3},{"$nulls":29},{"$f":"B40","v":3},{"$f":"C40","v":3},{"$f":"D40","v":3},{"$nulls":54},{"$f":"SUM(B40)","v":3},{"$f":"SUM(C40)","v":3},3,{"$f":"E40*3","v":3},{"$nulls":4},{"$f":"SUM(B40)","v":3},{"$f":"SUM(C40)","v":3},{"$f":"SUM(D40)","v":3},{"$f":"E40*2","v":2}]
["4.B. Adequacy of human, material, and financial resources for diagnostic needs",{"$f":"IF('Scoring criteria'!E50<> \"NA\",'Scoring criteria'!E50-'Scoring criteria'!E50*financial!B21,'Scoring criteria'!E50)","v":0},{"$f":"IF('Scoring criteria'!E50<> \"NA\",'Scoring criteria'!E50-'Scoring criteria'!E50*financial!D21,'Scoring criteria'!E50)","v":0},{"$f":"IF('Scoring criteria'!E50<> \"NA\",'Scoring criteria'!E50-'Scoring criteria'!E50*financial!F21,'Scoring criteria'!E50)","v":0},1,{"$nulls":85},{"$f":"B41","v":0},{"$f":"C41","v":0},{"$f":"D41","v":0},null,{"$f":"B41","v":0},{"$f":"C41","v":0},{"$f":"D41","v":0},{"$nulls":26},{"$f":"SUM(B41)","v":0},{"$f":"SUM(C41)","v":0},{"$f":"SUM(D41)","v":0},{"$f":"E41*3","v":3},{"$nulls":4},0,0,0,{"$f":"E41*3","v":3},{"$f":"SUM(B41)","v":0},0,0,{"$f":"E41*3","v":3}]
["4.C. Application of Quality Assurance for the tests undertaken",{"$f":"IF('Scoring criteria'!E51<> \"NA\",'Scoring criteria'!E51-'Scoring criteria'!E51*financial!B21,'Scoring criteria'!E51)","v":3},{"$f":"IF('Scoring criteria'!E51<> \"NA\",'Scoring criteria'!E51-'Scoring criteria'!E51*financial!D21,'Scoring criteria'!E51)","v":3},{"$f":"IF('Scoring criteria'!E51<> \"NA\",'Scoring criteria'!E51-'Scoring criteria'!E51*financial!F21,'Scoring criteria'!E51)","v":3},1,{"$nulls":77},{"$f":"B42","v":3},3,3,{"$nulls":46},3,3,3,{"$f":"E42*3","v":3},3,3,3,{"$f":"E42*3","v":3}]
["4.D. Quality of the standardization of work between different laboratories",{"$f":"'Scoring criteria'!E52","v":3},{"$f":"B43","v":3},{"$f":"C43","v":3},1,{"$nulls":77},3,3,3,{"$nulls":46},3,3,3,{"$f":"E43*3","v":3},3,3,3,{"$f":"E43*3","v":3}]
["4.E. Proportion of tests submitted to inter-laboratory trials",{"$f":"IF('Scoring criteria'!E53<> \"NA\",'Scoring criteria'!E53-'Scoring criteria'!E53*financial!B21,'Scoring criteria'!E53)","v":3},{"$f":"IF('Scoring criteria'!E53<> \"NA\",'Scoring criteria'!E53-'Scoring criteria'!E53*financial!D21,'Scoring criteria'!E53)","v":3},{"$f":"IF('Scoring criteria'!E53<> \"NA\",'Scoring criteria'!E53-'Scoring criteria'!E53*financial!F21,'Scoring criteria'!E53)","v":3},1,{"$nulls":77},3,3,3,{"$nulls":46},3,3,3,{"$f":"E44*3","v":3},3,3,3,{"$f":"E44*3","v":3}]
["4.F. Existence of an investigation team to support field agents",{"$f":"IF('Scoring criteria'!E54<> \"NA\",'Scoring criteria'!E54-'Scoring criteria'!E54*financial!B21,'Scoring criteria'!E54)","v":2},{"$f":"IF('Scoring criteria'!E54<> \"NA\",'Scoring criteria'!E54-'Scoring criteria'!E54*financial!D21,'Scoring criteria'!E54)","v":2},{"$f":"IF('Scoring criteria'!E54<> \"NA\",'Scoring criteria'!E54-'Scoring criteria'!E54*financial!F21,'Scoring criteria'!E54)","v":2},1,{"$nulls":45},{"$f":"B45","v":2},{"$f":"C45","v":2},{"$f":"D45","v":2},{"$nulls":70},{"$f":"SUM(B45)","v":2},{"$f":"SUM(C45)","v":2},{"$f":"SUM(D45)","v":2},{"$f":"E45*1","v":1},{"$f":"SUM(B45)","v":2},{"$f":"SUM(C45)","v":2},{"$f":"SUM(D45)","v":2},{"$f":"E45*2","v":2},2,2,2,{"$f":"E45*1","v":1}]
["4.G. Relevance of diagnostic techniques",{"$f":"'Scoring criteria'!E55","v":3},{"$f":"B46","v":3},3,1,{"$nulls":69},{"$f":"B46","v":3},3,3,{"$nulls":34},{"$f":"SUM(B46)","v":3},3,3,{"$f":"E46*3","v":3},{"$nulls":16},3,3,3,{"$f":"E46*3","v":3}]
["4.H. Sensitivity of diagnostic techniques",{"$f":"'Scoring criteria'!E56","v":1.5},1.5,1.5,1,{"$nulls":69},1.5,1.5,1.5,{"$nulls":34},1.5,1.5,1.5,{"$f":"E47*3","v":3},{"$nulls":16},1.5,1.5,1.5,{"$f":"E47*3","v":3}]
["4.I. Specificity of diagnostic techniques",{"$f":"'Scoring criteria'!E57","v":1.5},1.5,1.5,1,{"$nulls":69},1.5,1.5,1.5,{"$nulls":38},{"$f":"SUM(B48)","v":1.5},{"$f":"SUM(C48)","v":1.5},{"$f":"SUM(D48)","v":1.5},{"$f":"E48*3","v":3},{"$nulls":12},1.5,1.5,1.5,{"$f":"E48*3","v":3}]
["4.J. Control of laboratory reagents",{"$f":"'Scoring criteria'!E58","v":3},3,3,1,{"$nulls":73},{"$f":"B49","v":3},{"$f":"C49","v":3},{"$f":"D49","v":3},{"$nulls":50},3,3,3,{"$f":"E49*3","v":3},{"$f":"SUM(B49)","v":3},{"$f":"SUM(C49)","v":3},{"$f":"SUM(D49)","v":3},{"$f":"E49*3","v":3}]
["4.K. Technical level of data management at the laboratory",{"$f":"'Scoring criteria'!E59","v":1.5},1.5,1.5,1,{"$nulls":89},{"$f":"B50","v":1.5},1.5,1.5,{"$nulls":26},{"$f":"SUM(B50)","v":1.5},1.5,1.5,{"$f":"E50*3","v":3},{"$nulls":4},1.5,1.5,1.5,{"$f":"E50*3","v":3},{"$nulls":8},{"$f":"SUM(B50)","v":1.5},{"$f":"SUM(C50)","v":1.5},{"$f":"SUM(D50)","v":1.5},{"$f":"E50*2","v":2}]
["4.L. Analysis deadlines at the laboratory (formalization, standardization, verification, transfer of results to the central unit)",{"$f":"IF('Scoring criteria'!E60<> \"NA\",'Scoring criteria'!E60-'Scoring criteria'!E60*financial!B21,'Scoring criteria'!E60)","v":0},{"$f":"IF('Scoring criteria'!E60<> \"NA\",'Scoring criteria'!E60-'Scoring criteria'!E60*financial!D21,'Scoring criteria'!E60)","v":0},{"$f":"IF('Scoring criteria'!E60<> \"NA\",'Scoring criteria'!E60-'Scoring criteria'!E60*financial!F21,'Scoring criteria'!E60)","v":0},1,{"$nulls":85},{"$f":"B51","v":0},{"$f":"C51","v":0},{"$f":"D51","v":0},null,0,0,0,{"$nulls":26},0,0,0,{"$f":"E51*6","v":6},{"$nulls":4},0,0,0,{"$f":"E51*1","v":1}]
["4. M. Quality of results delivered",{"$f":"'Scoring criteria'!E61","v":3},{"$f":"B52","v":3},{"$f":"C52","v":3},1,{"$nulls":77},{"$f":"B52","v":3},{"$f":"C52","v":3},{"$f":"D52","v":3},{"$nulls":46},3,3,3,{"$f":"E52*3","v":3}]
[null,{"$f":"SUM(B40:B52)","v":27.5},{"$f":"SUM(C40:C52)","v":27.5},{"$f":"SUM(D40:D52)","v":27.5},{"$f":"SUM(E40:E52)*3","v":39},"date + 6 months",{"$f":"B53/E53","v":0.70512820512820518},{"$f":"B53","v":27.5},{"$f":"E53-B53","v":11.5}]
[{"$nulls":5},"date + 1 year",{"$f":"C53/E53","v":0.70512820512820518},{"$f":"C53","v":27.5},{"$f":"E53-C53","v":11.5}]
[{"$nulls":5},"date +2 years",{"$f":"D53/E53","v":0.70512820512820518},{"$f":"D53","v":27.5},{"$f":"E53-D53","v":11.5}]
["Section 5: Surveillance tools"]
["5.A. Existence of a formalized surveillance protocol for each disease or threat under surveillance",{"$f":"'Scoring criteria'!E67","v":2},{"$f":"B57","v":2},2,{"$f":"IF(OR(B57=\"SO\",B57=\"NA\"),0,1)","v":1},{"$nulls":65},{"$f":"B57","v":2},{"$f":"C57","v":2},{"$f":"D57","v":2},{"$nulls":58},{"$f":"SUM(B57)","v":2},2,2,{"$f":"E57*3","v":3},{"$f":"SUM(B57)","v":2},2,2,{"$f":"E57*3","v":3}]
["5.B. Standardization of data collected",{"$f":"'Scoring criteria'!E68","v":3},3,3,1,{"$nulls":61},{"$f":"B58","v":3},3,3,{"$nulls":62},3,3,3,{"$f":"E58*3","v":3},3,3,3,{"$f":"E58*3","v":3}]
["5.C. Relevance of measurement tools (excluding laboratory tools)",{"$f":"'Scoring criteria'!E69","v":3},3,3,1,{"$nulls":61},3,3,3,{"$nulls":62},3,3,3,{"$f":"E59*3","v":3}]
["5.D. Sensitivity of the case or threat definition",{"$f":"'Scoring criteria'!E70","v":3},3,3,1,{"$nulls":61},3,3,3,{"$nulls":42},{"$f":"SUM(B60)","v":3},{"$f":"SUM(C60)","v":3},{"$f":"SUM(D60)","v":3},{"$f":"E60*3","v":3}]
["5.E. Specificity of the case or threat definition",{"$f":"'Scoring criteria'!E71","v":1.5},1.5,1.5,1,{"$nulls":61},1.5,1.5,1.5,{"$nulls":46},{"$f":"SUM(B61)","v":1.5},{"$f":"SUM(C61)","v":1.5},{"$f":"SUM(D61)","v":1.5},{"$f":"E61*3","v":3}]
["5.F. Simplicity of the case or threat definition",{"$f":"'Scoring criteria'!E72","v":2},2,2,1,{"$nulls":61},2,2,2,{"$nulls":70},{"$f":"SUM(B62)","v":2},{"$f":"SUM(C62)","v":2},{"$f":"SUM(D62)","v":2},{"$f":"E62*3","v":3},{"$f":"SUM(B62)","v":2},{"$f":"SUM(C62)","v":2},{"$f":"SUM(D62)","v":2},{"$f":"E62*3","v":3}]
["5.G. Quality of the filling out of investigation forms",{"$f":"'Scoring criteria'!E73","v":3},3,3,1,{"$nulls":81},{"$f":"B63","v":3},{"$f":"C63","v":3},{"$f":"D63","v":3},{"$nulls":42},{"$f":"SUM(B63)","v":3},3,3,{"$f":"E63*3","v":3}]
["5.H. Relevance of collected  samples",{"$f":"'Scoring criteria'!E74","v":2.5},2.5,2.5,1,{"$nulls":65},{"$f":"B64","v":2.5},2.5,2.5,{"$nulls":38},{"$f":"SUM(B64)","v":2.5},{"$f":"SUM(C64)","v":2.5},{"$f":"SUM(D64)","v":2.5},{"$f":"E64*3","v":3},{"$nulls":16},2.5,2.5,2.5,{"$f":"E64*3","v":3},{"$nulls":12},{"$f":"SUM(B64)","v":2.5},{"$f":"SUM(C64)","v":2.5},{"$f":"SUM(D64)","v":2.5},{"$f":"E64*3","v":3}]
["5.I. Standardization of collected samples",{"$f":"IF('Scoring criteria'!E75=\"NA\",'Scoring criteria'!E75,IF(AND('financial sheet'!B76<>\"NA\",'financial sheet'!B78<>\"NA\"),'Scoring criteria'!E75-('Scoring criteria'!E75*(financial!B26+financial!B31))/2,IF('financial sheet'!B76=\"NA\",'Scoring criteria'!E75-'Scoring criteria'!E75*financial!B31,'Scoring criteria'!E75-'Scoring criteria'!E75*financial!B26)))","v":3},{"$f":"IF('Scoring criteria'!E75=\"NA\",'Scoring criteria'!E75,IF(AND('financial sheet'!B76<>\"NA\",'financial sheet'!B78<>\"NA\"),'Scoring criteria'!E75-('Scoring criteria'!E75*(financial!D26+financial!D31))/2,IF('financial sheet'!B76=\"NA\",'Scoring criteria'!E75-'Scoring criteria'!E75*financial!D31,'Scoring criteria'!E75-'Scoring criteria'!E75*financial!D26)))","v":3},{"$f":"IF('Scoring criteria'!E75=\"NA\",'Scoring criteria'!E75,IF(AND('financial sheet'!B76<>\"NA\",'financial sheet'!B78<>\"NA\"),'Scoring criteria'!E75-('Scoring criteria'!E75*(financial!F26+financial!F31))/2,IF('financial sheet'!B76=\"NA\",'Scoring criteria'!E75-'Scoring criteria'!E75*financial!F31,'Scoring criteria'!E75-'Scoring criteria'!E75*financial!F26)))","v":3},1,{"$nulls":65},3,3,3,{"$nulls":58},3,3,3,{"$f":"E65*3","v":3}]
["5.J. Quality of samples collected",{"$f":"IF('Scoring criteria'!E76=\"NA\",'Scoring criteria'!E76,IF(AND('financial sheet'!B77<>\"NA\",'financial sheet'!B79<>\"NA\"),'Scoring criteria'!E76-('Scoring criteria'!E76*(financial!B26+financial!B31))/2,IF('financial sheet'!B77=\"NA\",'Scoring criteria'!E76-'Scoring criteria'!E76*financial!B31,'Scoring criteria'!E76-'Scoring criteria'!E76*financial!B26)))","v":3},{"$f":"IF('Scoring criteria'!E76=\"NA\",'Scoring criteria'!E76,IF(AND('financial sheet'!B77<>\"NA\",'financial sheet'!B79<>\"NA\"),'Scoring criteria'!E76-('Scoring criteria'!E76*(financial!D26+financial!D31))/2,IF('financial sheet'!B77=\"NA\",'Scoring criteria'!E76-'Scoring criteria'!E76*financial!D31,'Scoring criteria'!E76-'Scoring criteria'!E76*financial!D26)))","v":3},{"$f":"IF('Scoring criteria'!E76=\"NA\",'Scoring criteria'!E76,IF(AND('financial sheet'!B77<>\"NA\",'financial sheet'!B79<>\"NA\"),'Scoring criteria'!E76-('Scoring criteria'!E76*(financial!F26+financial!F31))/2,IF('financial sheet'!B77=\"NA\",'Scoring criteria'!E76-'Scoring criteria'!E76*financial!F31,'Scoring criteria'!E76-'Scoring criteria'!E76*financial!F26)))","v":3},1,{"$nulls":65},3,3,3,{"$nulls":13},{"$f":"B66","v":3},{"$f":"C66","v":3},{"$f":"D66","v":3},{"$nulls":22},{"$f":"SUM(B66)","v":3},{"$f":"SUM(C66)","v":3},{"$f":"SUM(D66)","v":3},{"$f":"E66*3","v":3},{"$nulls":16},3,3,3,{"$f":"E66*3","v":3}]
["5.K. Respect of the interval between the detection of a case or threat and the delivery of results",{"$f":"'Scoring criteria'!E77","v":3},3,3,1,{"$nulls":85},{"$f":"B67","v":3},3,3]
["5.L. Simplicity of the notification procedure",{"$f":"IF('Scoring criteria'!E78<> \"NA\",'Scoring criteria'!E78-'Scoring criteria'!E78*financial!B26,'Scoring criteria'!E78)","v":2},{"$f":"IF('Scoring criteria'!E78<> \"NA\",'Scoring criteria'!E78-'Scoring criteria'!E78*financial!D26,'Scoring criteria'!E78)","v":2},{"$f":"IF('Scoring criteria'!E78<> \"NA\",'Scoring criteria'!E78-'Scoring criteria'!E78*financial!F26,'Scoring criteria'!E78)","v":2},1,{"$nulls":85},2,2,2,{"$nulls":46},{"$f":"SUM(B68)","v":2},2,2,{"$f":"E68*3","v":3},{"$f":"SUM(B68)","v":2},2,2,{"$f":"E68*3","v":3}]
["5.M. Simplicity of the data collection procedure",{"$f":"IF('Scoring criteria'!E79=\"NA\",'Scoring criteria'!E79,IF(AND('financial sheet'!B76<>\"NA\",'financial sheet'!B78<>\"NA\"),'Scoring criteria'!E79-('Scoring criteria'!E79*(financial!B26+financial!B31))/2,IF('financial sheet'!B76=\"NA\",'Scoring criteria'!E79-'Scoring criteria'!E79*financial!B31,'Scoring criteria'!E79-'Scoring criteria'!E79*financial!B26)))","v":2.5},{"$f":"IF('Scoring criteria'!E79=\"NA\",'Scoring criteria'!E79,IF(AND('financial sheet'!B76<>\"NA\",'financial sheet'!B78<>\"NA\"),'Scoring criteria'!E79-('Scoring criteria'!E79*(financial!D26+financial!D31))/2,IF('financial sheet'!B76=\"NA\",'Scoring criteria'!E79-'Scoring criteria'!E79*financial!D31,'Scoring criteria'!E79-'Scoring criteria'!E79*financial!D26)))","v":2.5},{"$f":"IF('Scoring criteria'!E79=\"NA\",'Scoring criteria'!E79,IF(AND('financial sheet'!B76<>\"NA\",'financial sheet'!B78<>\"NA\"),'Scoring criteria'!E79-('Scoring criteria'!E79*(financial!F26+financial!F31))/2,IF('financial sheet'!B76=\"NA\",'Scoring criteria'!E79-'Scoring criteria'!E79*financial!F31,'Scoring criteria'!E79-'Scoring criteria'!E79*financial!F26)))","v":2.5},1,{"$nulls":134},2.5,2.5,2.5,{"$f":"E69*3","v":3},2.5,2.5,2.5,{"$f":"E69*3","v":3}]
["5.N. Acceptability of the consequences of a suspicion or case for the source or collector of data",{"$f":"IF('Scoring criteria'!E80<> \"NA\",'Scoring criteria'!E80-'Scoring criteria'!E80*financial!B26,'Scoring criteria'!E80)","v":1.5},{"$f":"IF('Scoring criteria'!E80<> \"NA\",'Scoring criteria'!E80-'Scoring criteria'!E80*financial!D26,'Scoring criteria'!E80)","v":1.5},{"$f":"IF('Scoring criteria'!E80<> \"NA\",'Scoring criteria'!E80-'Scoring criteria'!E80*financial!F26,'Scoring criteria'!E80)","v":1.5},1,{"$nulls":106},{"$f":"SUM(B70)","v":1.5},{"$f":"SUM(C70)","v":1.5},{"$f":"SUM(D70)","v":1.5},{"$f":"E70*3","v":3}]
[null,{"$f":"SUM(B57:B70)","v":35},{"$f":"SUM(C57:C70)","v":35},{"$f":"SUM(D57:D70)","v":35},{"$f":"SUM(E57:E70)*3","v":42},"date + 6 months",{"$f":"B71/E71","v":0.83333333333333337},{"$f":"B71","v":35},{"$f":"E71-B71","v":7}]
[{"$nulls":5},"date + 1 year",{"$f":"C71/E71","v":0.83333333333333337},{"$f":"C71","v":35},{"$f":"E71-C71","v":7}]
[{"$nulls":5},"date +2 years",{"$f":"D71/E71","v":0.83333333333333337},{"$f":"D71","v":35},{"$f":"E71-D71","v":7}]
["Section 6: Surveillance procedures"]
["6.A. Appropriateness of surveillance procedures with the system's objectives",{"$f":"IF('Scoring criteria'!E86<> \"NA\",'Scoring criteria'!E86-('Scoring criteria'!E86*(financial!B26+financial!B31))/2,'Scoring criteria'!E86)","v":0},{"$f":"IF('Scoring criteria'!E86<> \"NA\",'Scoring criteria'!E86-('Scoring criteria'!E86*(financial!D26+financial!D31))/2,'Scoring criteria'!E86)","v":0},{"$f":"IF('Scoring criteria'!E86<> \"NA\",'Scoring criteria'!E86-('Scoring criteria'!E86*(financial!F26+financial!F31))/2,'Scoring criteria'!E86)","v":0},{"$f":"IF(OR(B75=\"SO\",B75=\"NA\"),0,1)","v":1},{"$nulls":5},{"$f":"B75","v":0},{"$f":"C75","v":0},{"$f":"D75","v":0},{"$nulls":118},{"$f":"SUM(B75)","v":0},{"$f":"SUM(C75)","v":0},{"$f":"SUM(D75)","v":0},{"$f":"E75*3","v":3},{"$nulls":12},{"$f":"SUM(B75)","v":0},{"$f":"SUM(C75)","v":0},{"$f":"SUM(D75)","v":0},{"$f":"E75*3","v":3}]
["6.B. Existence of passive (event-based) surveillance whose results are exhaustive or representative",{"$f":"'Scoring criteria'!E87","v":3},{"$f":"B76","v":3},{"$f":"C76","v":3},1,{"$nulls":13},{"$f":"B76*4","v":12},{"$f":"C76*4","v":12},{"$f":"D76*4","v":12},null,{"$f":"B76*4","v":12},{"$f":"C76*4","v":12},{"$f":"D76*4","v":12},{"$nulls":5},{"$f":"B76*3","v":9},{"$f":"C76*3","v":9},{"$f":"D76*3","v":9},{"$nulls":78},{"$f":"SUM(B76)","v":3},3,3,{"$f":"E76*6","v":6},{"$nulls":4},{"$f":"SUM(B76)","v":3},{"$f":"SUM(C76)","v":3},{"$f":"SUM(D76)","v":3},{"$f":"E76*3","v":3}]
["6.C. Existence of awareness building programs for data sources in a passive (event-based) network ",{"$f":"IF('Scoring criteria'!E88<> \"NA\",'Scoring criteria'!E88-'Scoring criteria'!E88*financial!B26,'Scoring criteria'!E88)","v":2},{"$f":"IF('Scoring criteria'!E88<> \"NA\",'Scoring criteria'!E88-'Scoring criteria'!E88*financial!D26,'Scoring criteria'!E88)","v":2},{"$f":"IF('Scoring criteria'!E88<> \"NA\",'Scoring criteria'!E88-'Scoring criteria'!E88*financial!F26,'Scoring criteria'!E88)","v":2},1,{"$nulls":33},{"$f":"B77","v":2},{"$f":"C77","v":2},{"$f":"D77","v":2},null,{"$f":"B77","v":2},{"$f":"C77","v":2},{"$f":"D77","v":2},null,{"$f":"B77","v":2},{"$f":"C77","v":2},{"$f":"D77","v":2},{"$nulls":62},2,2,2,{"$f":"E77*3","v":3},{"$f":"SUM(B77)","v":2},{"$f":"SUM(C77)","v":2},{"$f":"SUM(D77)","v":2},{"$f":"E77*2","v":2},{"$nulls":20},{"$f":"SUM(B77)","v":2},{"$f":"SUM(C77)","v":2},{"$f":"SUM(D77)","v":2},{"$f":"E77*3","v":3}]
["6.D. Relevance and suitability of active (planned) surveillance protocols ",{"$f":"IF('Scoring criteria'!E89<> \"NA\",'Scoring criteria'!E89-('Scoring criteria'!E89*(financial!B29+financial!B34))/2,'Scoring criteria'!E89)","v":1},{"$f":"IF('Scoring criteria'!E89<> \"NA\",'Scoring criteria'!E89-'Scoring criteria'!E89*financial!D31,'Scoring criteria'!E89)","v":1},{"$f":"IF('Scoring criteria'!E89<> \"NA\",'Scoring criteria'!E89-'Scoring criteria'!E89*financial!F31,'Scoring criteria'!E89)","v":1},1,{"$nulls":13},{"$f":"B78","v":1},{"$f":"C78","v":1},{"$f":"D78","v":1},null,{"$f":"B78","v":1},{"$f":"C78","v":1},{"$f":"D78","v":1},null,{"$f":"B78","v":1},{"$f":"C78","v":1},{"$f":"D78","v":1},{"$nulls":82},1,1,1,{"$f":"E78*3","v":3},{"$nulls":4},{"$f":"SUM(B78)","v":1},{"$f":"SUM(C78)","v":1},{"$f":"SUM(D78)","v":1},{"$f":"E78*3","v":3}]
["6.E. Surveillance of susceptible wild animals",{"$f":"IF('Scoring criteria'!E90<> \"NA\",'Scoring criteria'!E90-('Scoring criteria'!E90*(financial!B30+financial!B35))/2,'Scoring criteria'!E90)","v":0},{"$f":"IF('Scoring criteria'!E90<> \"NA\",'Scoring criteria'!E90-'Scoring criteria'!E90*financial!D36,'Scoring criteria'!E90)","v":0},{"$f":"IF('Scoring criteria'!E90<> \"NA\",'Scoring criteria'!E90-'Scoring criteria'!E90*financial!F36,'Scoring criteria'!E90)","v":0},1,{"$nulls":53},{"$f":"B79","v":0},{"$f":"C79","v":0},{"$f":"D79","v":0},{"$nulls":50},0,0,0,{"$f":"E79*2","v":2}]
["6.F. Vector surveillance and control",{"$f":"IF('Scoring criteria'!E91<> \"NA\",'Scoring criteria'!E91-('Scoring criteria'!E91*(financial!B31+financial!B36))/2,'Scoring criteria'!E91)","v":"NA"},{"$f":"IF('Scoring criteria'!E91<> \"NA\",'Scoring criteria'!E91-'Scoring criteria'!E91*financial!D33,'Scoring criteria'!E91)","v":"NA"},{"$f":"IF('Scoring criteria'!E91<> \"NA\",'Scoring criteria'!E91-'Scoring criteria'!E91*financial!F33,'Scoring criteria'!E91)","v":"NA"},0,{"$nulls":57},{"$f":"B80","v":"NA"},{"$f":"C80","v":"NA"},{"$f":"D80","v":"NA"},{"$nulls":46},0,0,0,{"$f":"E80*1","v":0}]
["6.G. Representativeness of the populations targeted by sampling in active (planned) surveillance",{"$f":"'Scoring criteria'!E92","v":"NA"},{"$f":"B81","v":"NA"},{"$f":"C81","v":"NA"},0,{"$nulls":17},{"$f":"B81","v":"NA"},{"$f":"C81","v":"NA"},{"$f":"D81","v":"NA"},{"$nulls":5},{"$f":"B81","v":"NA"},{"$f":"C81","v":"NA"},{"$f":"D81","v":"NA"},{"$nulls":86},{"$f":"SUM(B81)","v":0},{"$f":"SUM(C81)","v":0},{"$f":"SUM(D81)","v":0},{"$f":"E81*3","v":0},{"$nulls":8},{"$f":"SUM(B81)","v":0},0,0,{"$f":"E81*3","v":0}]
["6.H. Precision of sample under active (planned) surveillance",{"$f":"'Scoring criteria'!E93","v":"NA"},{"$f":"B82","v":"NA"},{"$f":"C82","v":"NA"},0,{"$nulls":21},{"$f":"B82","v":"NA"},"NA","NA",{"$nulls":5},{"$f":"B82","v":"NA"},{"$f":"C82","v":"NA"},{"$f":"D82","v":"NA"},{"$nulls":94},0,0,0,{"$f":"E82*2","v":0}]
["6.I. Level of satisfaction of active (planned) surveillance completeness rate",{"$f":"IF('Scoring criteria'!E94<> \"NA\",'Scoring criteria'!E94-('Scoring criteria'!E94*(financial!B34+financial!B39))/2,'Scoring criteria'!E94)","v":"NA"},{"$f":"IF('Scoring criteria'!E94<> \"NA\",'Scoring criteria'!E94-'Scoring criteria'!E94*financial!D31,'Scoring criteria'!E94)","v":"NA"},{"$f":"IF('Scoring criteria'!E94<> \"NA\",'Scoring criteria'!E94-'Scoring criteria'!E94*financial!F31,'Scoring criteria'!E94)","v":"NA"},0,{"$nulls":17},{"$f":"B83","v":"NA"},{"$f":"C83","v":"NA"},{"$f":"D83","v":"NA"},null,"NA","NA","NA",{"$nulls":82},{"$f":"SUM(B83)","v":0},{"$f":"SUM(C83)","v":0},{"$f":"SUM(D83)","v":0},{"$f":"E83*3","v":0},{"$nulls":4},{"$f":"SUM(B83)","v":0},{"$f":"SUM(C83)","v":0},{"$f":"SUM(D83)","v":0},{"$f":"E83*3","v":0},{"$nulls":8},0,0,0,{"$f":"E83*3","v":0}]
[null,{"$f":"SUM(B75:B83)","v":6},{"$f":"SUM(C75:C83)","v":6},{"$f":"SUM(D75:D83)","v":6},{"$f":"SUM(E75:E83)*3","v":15},"date + 6 months",{"$f":"B84/E84","v":0.4},{"$f":"B84","v":6},{"$f":"E84-B84","v":9}]
[{"$nulls":5},"date + 1 year",{"$f":"C84/E84","v":0.4},{"$f":"C84","v":6},{"$f":"E84-C84","v":9}]
[{"$nulls":5},"date +2 years",{"$f":"D84/E84","v":0.4},{"$f":"D84","v":6},{"$f":"E84-D84","v":9}]
["Section 7: Data management"]
["7.A. Adequacy of the data management system for the needs of the system (relational database, etc.)",{"$f":"'Scoring criteria'!E100","v":3},{"$f":"'Scoring criteria'!E100","v":3},{"$f":"'Scoring criteria'!E100","v":3},{"$f":"IF(OR(B88=\"SO\",B88=\"NA\"),0,1)","v":1},{"$nulls":89},{"$f":"B88","v":3},{"$f":"C88","v":3},{"$f":"D88","v":3},{"$nulls":26},{"$f":"SUM(B88)","v":3},3,3,{"$f":"E88*2","v":2},{"$nulls":4},{"$f":"SUM(B88)","v":3},{"$f":"SUM(C88)","v":3},{"$f":"SUM(D88)","v":3},{"$f":"E88*2","v":2},{"$f":"SUM(B88)","v":3},{"$f":"SUM(C88)","v":3},{"$f":"SUM(D88)","v":3},{"$f":"E88*1","v":1},{"$f":"SUM(B88)","v":3},{"$f":"SUM(C88)","v":3},{"$f":"SUM(D88)","v":3},{"$f":"E88*2","v":2},{"$f":"SUM(B88)","v":3},{"$f":"SUM(C88)","v":3},{"$f":"SUM(D88)","v":3},{"$f":"E88*3","v":3},{"$f":"SUM(B88)","v":3},{"$f":"SUM(C88)","v":3},{"$f":"SUM(D88)","v":3},{"$f":"E88*3","v":3}]
["7.B. Data input interval in accordance with the objectives and use of system results",{"$f":"IF('Scoring criteria'!E101<> \"NA\",'Scoring criteria'!E101-'Scoring criteria'!E101*financial!B41,'Scoring criteria'!E101)","v":0},{"$f":"IF('Scoring criteria'!E101<> \"NA\",'Scoring criteria'!E101-'Scoring criteria'!E101*financial!D41,'Scoring criteria'!E101)","v":0},{"$f":"IF('Scoring criteria'!E101<> \"NA\",'Scoring criteria'!E101-'Scoring criteria'!E101*financial!F41,'Scoring criteria'!E101)","v":0},1,{"$nulls":85},{"$f":"B89","v":0},{"$f":"C89","v":0},{"$f":"D89","v":0},{"$nulls":30},0,0,0,{"$f":"E89*2","v":2}]
["7.C. Designated staff available and trained in data entry, management and analysis.",{"$f":"IF('Scoring criteria'!E102<> \"NA\",'Scoring criteria'!E102-'Scoring criteria'!E102*(financial!B41+financial!B46+financial!B51)/3,'Scoring criteria'!E102)","v":1},{"$f":"IF('Scoring criteria'!E102<> \"NA\",'Scoring criteria'!E102-'Scoring criteria'!E102*(financial!D41+financial!D46+financial!D51)/3,'Scoring criteria'!E102)","v":1},{"$f":"IF('Scoring criteria'!E102<> \"NA\",'Scoring criteria'!E102-'Scoring criteria'!E102*(financial!F41+financial!F46+financial!F51)/3,'Scoring criteria'!E102)","v":1},1,{"$nulls":45},{"$f":"B90","v":1},{"$f":"C90","v":1},{"$f":"D90","v":1},{"$nulls":41},{"$f":"B90","v":1},{"$f":"C90","v":1},{"$f":"D90","v":1},{"$nulls":26},1,1,1,{"$f":"E90*2","v":2},{"$nulls":4},{"$f":"SUM(B90)","v":1},1,1,{"$f":"E90*3","v":3}]
["7.D. Adequacy of material and financial resources for data management and analysis",{"$f":"IF('Scoring criteria'!E103<> \"NA\",'Scoring criteria'!E103-'Scoring criteria'!E103*(financial!B41+financial!B46+financial!B51)/3,'Scoring criteria'!E103)","v":0},{"$f":"IF('Scoring criteria'!E103<> \"NA\",'Scoring criteria'!E103-'Scoring criteria'!E103*(financial!D41+financial!D46+financial!D51)/3,'Scoring criteria'!E103)","v":0},{"$f":"IF('Scoring criteria'!E103<> \"NA\",'Scoring criteria'!E103-'Scoring criteria'!E103*(financial!F41+financial!F46+financial!F51)/3,'Scoring criteria'!E103)","v":0},1,{"$nulls":126},0,0,0,{"$f":"E91*3","v":3},{"$f":"SUM(B91)","v":0},{"$f":"SUM(C91)","v":0},{"$f":"SUM(D91)","v":0},{"$f":"E91*2","v":2}]
["7.E. Data verification and validation procedures formalized and operational",{"$f":"IF('Scoring criteria'!E104<> \"NA\",'Scoring criteria'!E104-'Scoring criteria'!E104*financial!B46,'Scoring criteria'!E104)","v":1},{"$f":"IF('Scoring criteria'!E104<> \"NA\",'Scoring criteria'!E104-'Scoring criteria'!E104*financial!D46,'Scoring criteria'!E104)","v":1},{"$f":"IF('Scoring criteria'!E104<> \"NA\",'Scoring criteria'!E104-'Scoring criteria'!E104*financial!F46,'Scoring criteria'!E104)","v":1},1,{"$nulls":89},{"$f":"B92","v":1},1,1,{"$nulls":34},1,1,1,{"$f":"E92*3","v":3}]
["7.F. Complete descriptive processing of data",{"$f":"IF('Scoring criteria'!E105<> \"NA\",'Scoring criteria'!E105-'Scoring criteria'!E105*financial!B51,'Scoring criteria'!E105)","v":3},{"$f":"IF('Scoring criteria'!E105<> \"NA\",'Scoring criteria'!E105-'Scoring criteria'!E105*financial!D51,'Scoring criteria'!E105)","v":3},{"$f":"IF('Scoring criteria'!E105<> \"NA\",'Scoring criteria'!E105-'Scoring criteria'!E105*financial!F51,'Scoring criteria'!E105)","v":3},1,{"$nulls":89},3,3,3,{"$nulls":50},{"$f":"SUM(B93)","v":3},3,3,{"$f":"E93*1","v":1}]
["7.G. Exploitation of data fits the needs of the system (if possible regular and multi-disciplinary)",{"$f":"IF('Scoring criteria'!E106<> \"NA\",'Scoring criteria'!E106-'Scoring criteria'!E106*financial!B51,'Scoring criteria'!E106)","v":0},{"$f":"IF('Scoring criteria'!E106<> \"NA\",'Scoring criteria'!E106-'Scoring criteria'!E106*financial!D51,'Scoring criteria'!E106)","v":0},{"$f":"IF('Scoring criteria'!E106<> \"NA\",'Scoring criteria'!E106-'Scoring criteria'!E106*financial!F51,'Scoring criteria'!E106)","v":0},1,{"$nulls":93},{"$f":"B94","v":0},{"$f":"C94","v":0},{"$f":"D94","v":0},{"$nulls":30},{"$f":"SUM(B94)","v":0},{"$f":"SUM(C94)","v":0},{"$f":"SUM(D94)","v":0},{"$f":"E94*3","v":3},{"$nulls":12},0,0,0,{"$f":"E94*3","v":3}]
[null,{"$f":"SUM(B88:B94)","v":8},{"$f":"SUM(C88:C94)","v":8},{"$f":"SUM(D88:D94)","v":8},{"$f":"SUM(E88:E94)*3","v":21},"date + 6 months",{"$f":"B95/E95","v":0.38095238095238093},{"$f":"B95","v":8},{"$f":"E95-B95","v":13}]
[{"$nulls":5},"date + 1 year",{"$f":"C95/E95","v":0.38095238095238093},{"$f":"C95","v":8},{"$f":"E95-C95","v":13}]
[{"$nulls":5},"date +2 years",{"$f":"D95/E95","v":0.38095238095238093},{"$f":"D95","v":8},{"$f":"E95-D95","v":13}]
["Section 8: Training"]
["8.A. Adequate skill level in epidemiology of members of the central unit",{"$f":"'Scoring criteria'!E112","v":1},{"$f":"'Scoring criteria'!E112","v":1},{"$f":"C99","v":1},{"$f":"IF(OR(B99=\"SO\",B99=\"NA\"),0,1)","v":1},{"$nulls":45},{"$f":"B99","v":1},{"$f":"C99","v":1},{"$f":"D99","v":1},{"$nulls":41},{"$f":"B99","v":1},{"$f":"C99","v":1},{"$f":"D99","v":1},null,{"$f":"B99","v":1},{"$f":"C99","v":1},{"$f":"D99","v":1},{"$nulls":30},{"$f":"SUM(B99)","v":1},1,1,{"$f":"E99*3","v":3}]
["8.B. Initial training implemented for all field agents when joining the system",{"$f":"'Scoring criteria'!E113","v":1},{"$f":"'Scoring criteria'!E113","v":1},{"$f":"C100","v":1},{"$f":"IF(OR(B100=\"SO\",B100=\"NA\"),0,1)","v":1},{"$nulls":33},{"$f":"B100","v":1},{"$f":"C100","v":1},{"$f":"D100","v":1},{"$nulls":25},{"$f":"B100","v":1},1,1,null,{"$f":"B100","v":1},1,1,{"$nulls":13},{"$f":"B100","v":1},1,1,{"$nulls":26},{"$f":"SUM(B100)","v":1},{"$f":"SUM(C100)","v":1},{"$f":"SUM(D100)","v":1},{"$f":"E100*2","v":2},{"$nulls":12},1,1,1,{"$f":"E100*3","v":3},{"$nulls":4},{"$f":"SUM(B100)","v":1},{"$f":"SUM(C100)","v":1},{"$f":"SUM(D100)","v":1},{"$f":"E100*3","v":3},{"$f":"SUM(B100)","v":1},{"$f":"SUM(C100)","v":1},{"$f":"SUM(D100)","v":1},{"$f":"E100*3","v":3}]
["8.C. Objectives and contents of initial training of system field actors adequate for operational surveillance needs",{"$f":"'Scoring criteria'!E114","v":2.5},{"$f":"'Scoring criteria'!E114","v":2.5},2.5,{"$f":"IF(OR(B101=\"SO\",B101=\"NA\"),0,1)","v":1},{"$nulls":61},2.5,2.5,2.5,null,2.5,2.5,2.5,{"$nulls":13},2.5,2.5,2.5,{"$nulls":42},2.5,2.5,2.5,{"$f":"E101*3","v":3}]
["8.D. Regular advanced training",{"$f":"'Scoring criteria'!E115","v":0},{"$f":"'Scoring criteria'!E115","v":0},0,{"$f":"IF(OR(B102=\"SO\",B102=\"NA\"),0,1)","v":1},{"$nulls":37},{"$f":"B102","v":0},{"$f":"C102","v":0},{"$f":"D102","v":0},{"$nulls":21},0,0,0,null,0,0,0,{"$nulls":13},0,0,0,{"$nulls":22},{"$f":"SUM(B102)","v":0},{"$f":"SUM(C102)","v":0},{"$f":"SUM(D102)","v":0},{"$f":"E102*3","v":3},{"$f":"SUM(B102)","v":0},{"$f":"SUM(C102)","v":0},{"$f":"SUM(D102)","v":0},{"$f":"E102*2","v":2},{"$nulls":8},{"$f":"SUM(B102)","v":0},{"$f":"SUM(C102)","v":0},{"$f":"SUM(D102)","v":0},{"$f":"E102*3","v":3}]
["8.E. Adequacy of material and financial resources for training",{"$f":"'Scoring criteria'!E116","v":1},{"$f":"'Scoring criteria'!E116","v":1},1,{"$f":"IF(OR(B103=\"SO\",B103=\"NA\"),0,1)","v":1},{"$nulls":126},{"$f":"SUM(B103)","v":1},{"$f":"SUM(C103)","v":1},{"$f":"SUM(D103)","v":1},{"$f":"E103*2","v":2},{"$f":"SUM(B103)","v":1},{"$f":"SUM(C103)","v":1},{"$f":"SUM(D103)","v":1},{"$f":"E103*2","v":2}]
[null,{"$f":"SUM(B99:B103)","v":5.5},{"$f":"SUM(C99:C103)","v":5.5},{"$f":"SUM(D99:D103)","v":5.5},{"$f":"SUM(E99:E103)*3","v":15},"date + 6 months",{"$f":"B104/E104","v":0.36666666666666664},{"$f":"B104","v":5.5},{"$f":"E104-B104","v":9.5}]
[{"$nulls":5},"date + 1 year",{"$f":"C104/E104","v":0.36666666666666664},{"$f":"C104","v":5.5},{"$f":"E104-C104","v":9.5}]
[{"$nulls":5},"date +2 years",{"$f":"D104/E104","v":0.36666666666666664},{"$f":"D104","v":5.5},{"$f":"E104-D104","v":9.5}]
["Section 9 : Communication"]
["9.A Edition régulière de rapports et articles scientifiques sur les résultats de la surveillance",{"$f":"IF('Scoring criteria'!E122<> \"NA\",'Scoring criteria'!E122-'Scoring criteria'!E122*financial!B11,'Scoring criteria'!E122)","v":0},{"$f":"IF('Scoring criteria'!E122<> \"NA\",'Scoring criteria'!E122-'Scoring criteria'!E122*financial!D11,'Scoring criteria'!E122)","v":0},{"$f":"IF('Scoring criteria'!E122<> \"NA\",'Scoring criteria'!E122-'Scoring criteria'!E122*financial!F11,'Scoring criteria'!E122)","v":0},{"$f":"IF(OR(B108=\"SO\",B108=\"NA\"),0,1)","v":1},{"$nulls":97},{"$f":"B108","v":0},{"$f":"C108","v":0},{"$f":"D108","v":0},null,{"$f":"B108","v":0},{"$f":"C108","v":0},{"$f":"D108","v":0},{"$nulls":26},{"$f":"SUM(B108)","v":0},0,0,{"$f":"E108*2","v":2},{"$f":"SUM(B108)","v":0},0,0,{"$f":"E108*3","v":3}]
["9.B Restitution des résultats des analyses individuelles aux acteurs de terrain",{"$f":"IF('Scoring criteria'!E123<> \"NA\",'Scoring criteria'!E123-'Scoring criteria'!E123*financial!B11,'Scoring criteria'!E123)","v":3},{"$f":"IF('Scoring criteria'!E123<> \"NA\",'Scoring criteria'!E123-'Scoring criteria'!E123*financial!D11,'Scoring criteria'!E123)","v":3},{"$f":"IF('Scoring criteria'!E123<> \"na\",'Scoring criteria'!E123-'Scoring criteria'!E123*financial!F11,'Scoring criteria'!E123)","v":3},1,{"$nulls":85},{"$f":"B109","v":3},{"$f":"C109","v":3},{"$f":"D109","v":3},{"$nulls":18},{"$f":"SUM(B109)","v":3},3,3,{"$f":"E109*3","v":3},{"$nulls":20},3,3,3,{"$f":"E109*3","v":3},3,3,3,{"$f":"E109*3","v":3}]
["9.C Diffusion régulière d’un bulletin d’information pertinent",{"$f":"IF('Scoring criteria'!E124<> \"NA\",'Scoring criteria'!E124-'Scoring criteria'!E124*financial!B11,'Scoring criteria'!E124)","v":1.5},{"$f":"IF('Scoring criteria'!E124<> \"NA\",'Scoring criteria'!E124-'Scoring criteria'!E124*financial!D11,'Scoring criteria'!E124)","v":1.5},{"$f":"IF('Scoring criteria'!E124<> \"NA\",'Scoring criteria'!E124-'Scoring criteria'!E124*financial!F11,'Scoring criteria'!E124)","v":1.5},1,{"$nulls":37},{"$f":"B110","v":1.5},1.5,1.5,{"$nulls":57},{"$f":"B110","v":1.5},{"$f":"C110","v":1.5},{"$f":"D110","v":1.5},null,{"$f":"B110","v":1.5},1.5,1.5,null,null,1.5,1.5,1.5,{"$f":"E110*3","v":3},{"$nulls":32},{"$f":"SUM(B110)","v":1.5},1.5,1.5,{"$f":"E110*2","v":2}]
["9.D Restitution systématique des bilans de résultats aux acteurs de terrain (hors bulletin)",{"$f":"IF('Scoring criteria'!E125<> \"NA\",'Scoring criteria'!E125-'Scoring criteria'!E125*financial!B11,'Scoring criteria'!E125)","v":3},{"$f":"IF('Scoring criteria'!E125<> \"na\",'Scoring criteria'!E125-'Scoring criteria'!E125*financial!D11,'Scoring criteria'!E125)","v":3},{"$f":"IF('Scoring criteria'!E125<> \"na\",'Scoring criteria'!E125-'Scoring criteria'!E125*financial!F11,'Scoring criteria'!E125)","v":3},1,{"$nulls":37},3,3,3,{"$nulls":61},3,3,3,null,null,3,3,3,{"$f":"E111*3","v":3},{"$nulls":20},{"$f":"SUM(B111)","v":3},{"$f":"SUM(C111)","v":3},{"$f":"SUM(D111)","v":3},{"$f":"E111*2","v":2},{"$f":"SUM(B111)","v":3},{"$f":"SUM(C111)","v":3},{"$f":"SUM(D111)","v":3},{"$f":"E111*3","v":3},{"$nulls":4},3,3,3,{"$f":"E111*3","v":3}]
["9.E Présence d’un système d’échange d’informations organisé transversalement et verticalement entre les acteurs de terrain (mail et /ou web)",{"$f":"IF('Scoring criteria'!E126<> \"NA\",'Scoring criteria'!E126-'Scoring criteria'!E126*financial!B11,'Scoring criteria'!E126)","v":3},{"$f":"IF('Scoring criteria'!E126<> \"NA\",'Scoring criteria'!E126-'Scoring criteria'!E126*financial!D11,'Scoring criteria'!E126)","v":3},{"$f":"IF('Scoring criteria'!E126<> \"NA\",'Scoring criteria'!E126-'Scoring criteria'!E126*financial!F11,'Scoring criteria'!E126)","v":3},1,{"$nulls":85},{"$f":"B112","v":3},{"$f":"C112","v":3},{"$f":"D112","v":3},{"$nulls":18},3,3,3,{"$f":"E112*1","v":1},{"$nulls":8},{"$f":"SUM(B112)","v":3},{"$f":"SUM(C112)","v":3},{"$f":"SUM(D112)","v":3},{"$f":"E112*2","v":2}]
["9.F Politique de communication externe solide",{"$f":"IF('Scoring criteria'!E127<> \"NA\",'Scoring criteria'!E127-'Scoring criteria'!E127*financial!B11,'Scoring criteria'!E127)","v":3},{"$f":"IF('Scoring criteria'!E127<> \"NA\",'Scoring criteria'!E127-'Scoring criteria'!E127*financial!D11,'Scoring criteria'!E127)","v":3},{"$f":"IF('Scoring criteria'!E127<> \"NA\",'Scoring criteria'!E127-'Scoring criteria'!E127*financial!F11,'Scoring criteria'!E127)","v":3},1,{"$nulls":101},{"$f":"B113","v":3},{"$f":"C113","v":3},{"$f":"D113","v":3},{"$nulls":38},{"$f":"SUM(B113)","v":3},{"$f":"SUM(C113)","v":3},{"$f":"SUM(D113)","v":3},{"$f":"E113*2","v":2}]
["9.G Suffisance des moyens humains, matériels et financiers pour la communication",{"$f":"IF('Scoring criteria'!E128<> \"NA\",'Scoring criteria'!E128-'Scoring criteria'!E128*financial!B11,'Scoring criteria'!E128)","v":0},{"$f":"IF('Scoring criteria'!E128<> \"NA\",'Scoring criteria'!E128-'Scoring criteria'!E128*financial!D11,'Scoring criteria'!E128)","v":0},{"$f":"IF('Scoring criteria'!E128<> \"NA\",'Scoring criteria'!E128-'Scoring criteria'!E128*financial!F11,'Scoring criteria'!E128)","v":0},1,{"$nulls":130},{"$f":"SUM(B114)","v":0},{"$f":"SUM(C114)","v":0},{"$f":"SUM(D114)","v":0},{"$f":"E114*2","v":2}]
[null,{"$f":"SUM(B108:B114)","v":13.5},{"$f":"SUM(C108:C114)","v":13.5},{"$f":"SUM(D108:D114)","v":13.5},{"$f":"SUM(E108:E114)*3","v":21},"date + 6 months",{"$f":"B115/E115","v":0.6428571428571429},{"$f":"B115","v":13.5},{"$f":"E115-B115","v":7.5}]
[{"$nulls":5},"date + 1 year",{"$f":"C115/E115","v":0.6428571428571429},{"$f":"C115","v":13.5},{"$f":"E115-C115","v":7.5}]
[{"$nulls":5},"date +2 years",{"$f":"D115/E115","v":0.6428571428571429},{"$f":"D115","v":13.5},{"$f":"E115-D115","v":7.5}]
["Section 10 : Evaluation"]
["10.A Système d’indicateurs de performance développé et validé par les responsables du réseau",{"$f":"'Scoring criteria'!E134","v":0},{"$f":"B119","v":0},{"$f":"B119","v":0},{"$f":"IF(OR(B119=\"SO\",B119=\"NA\"),0,1)","v":1},{"$nulls":126},{"$f":"SUM(B119)","v":0},0,0,{"$f":"E119*3","v":3}]
["10.B Indicateurs de performance régulièrement calculés, interprétés et diffusés",{"$f":"IF('Scoring criteria'!E135<> \"NA\",'Scoring criteria'!E135-'Scoring criteria'!E135*financial!B56,'Scoring criteria'!E135)","v":0},{"$f":"IF('Scoring criteria'!E135<> \"NA\",'Scoring criteria'!E135-'Scoring criteria'!E135*financial!D56,'Scoring criteria'!E135)","v":0},{"$f":"IF('Scoring criteria'!E135<> \"NA\",'Scoring criteria'!E135-'Scoring criteria'!E135*financial!F56,'Scoring criteria'!E135)","v":0},{"$f":"IF(OR(B120=\"SO\",B120=\"NA\"),0,1)","v":1},{"$nulls":122},{"$f":"SUM(B120)","v":0},{"$f":"SUM(C120)","v":0},{"$f":"SUM(D120)","v":0},{"$f":"E120*3","v":3},0,0,0,{"$f":"E120*3","v":3}]
["10.C Evaluation externes effectuées",{"$f":"IF('Scoring criteria'!E136<> \"NA\",'Scoring criteria'!E136-'Scoring criteria'!E136*financial!B56,'Scoring criteria'!E136)","v":1},{"$f":"IF('Scoring criteria'!E136<> \"NA\",'Scoring criteria'!E136-'Scoring criteria'!E136*financial!D56,'Scoring criteria'!E136)","v":1},{"$f":"IF('Scoring criteria'!E136<> \"NA\",'Scoring criteria'!E136-'Scoring criteria'!E136*financial!F56,'Scoring criteria'!E136)","v":1},{"$f":"IF(OR(B121=\"SO\",B121=\"NA\"),0,1)","v":1},{"$nulls":126},1,1,1,{"$f":"E121*3","v":3}]
["10.D Mise en œuvre des mesures correctrices",{"$f":"IF('Scoring criteria'!E137<> \"NA\",'Scoring criteria'!E137-'Scoring criteria'!E137*financial!B56,'Scoring criteria'!E137)","v":1},{"$f":"IF('Scoring criteria'!E137<> \"NA\",'Scoring criteria'!E137-'Scoring criteria'!E137*financial!D56,'Scoring criteria'!E137)","v":1},{"$f":"IF('Scoring criteria'!E137<> \"NA\",'Scoring criteria'!E137-'Scoring criteria'!E137*financial!F56,'Scoring criteria'!E137)","v":1},{"$f":"IF(OR(B122=\"SO\",B122=\"NA\"),0,1)","v":1},{"$nulls":122},{"$f":"SUM(B122)","v":1},{"$f":"SUM(C122)","v":1},{"$f":"SUM(D122)","v":1},{"$f":"E122*3","v":3},1,1,1,{"$f":"E122*3","v":3}]
[null,{"$f":"SUM(B119:B122)","v":2},{"$f":"SUM(C116:C122)","v":2},{"$f":"SUM(D116:D122)","v":2},{"$f":"SUM(E119:E122)*3","v":12},"date + 6 months",{"$f":"B123/E123","v":0.16666666666666666},{"$f":"B123","v":2},{"$f":"E123-B123","v":10}]
[{"$nulls":5},"date + 1 year",{"$f":"C123/E123","v":0.16666666666666666},{"$f":"C123","v":2},{"$f":"E123-C123","v":10}]
[{"$nulls":5},"date +2 years",{"$f":"D123/E123","v":0.16666666666666666},{"$f":"D123","v":2},{"$f":"E123-D123","v":10}]
[]
["Resume output 1",null,null,null,"% of decrease"]
["score network","date + 6 months",null,{"$f":"H115+H104+H95+H84+H71+H53+H36+H24+H15","v":127.75},{"$f":"(D132-D128)/D132","v":1.5414258188824663E-2}]
[null,"date + 1 year",null,{"$f":"H116+H105+H96+H85+H72+H54+H37+H25+H15","v":127.75},{"$f":"(D132-D129)/D132","v":1.5414258188824663E-2}]
[null,"date +2 years",null,{"$f":"H117+H106+H97+H86+H73+H55+H38+H26+H15","v":127.75},{"$f":"(D132-D130)/D132","v":1.5414258188824663E-2}]
[]
[null,"date",null,{"$f":"'Calculation sheet'!E106+'Calculation sheet'!E100+'Calculation sheet'!E91+'Calculation sheet'!E84+'Calculation sheet'!E75+'Calculation sheet'!E64+'Calculation sheet'!E48+'Calculation sheet'!E33+'Calculation sheet'!E23+'Calculation sheet'!E14","v":129.75}]

{"sheet":"financial","index":13,"n_rows":56,"n_cols":6,"rows_kept":56,"cut":false,"hidden":true,"merged":[[37,0,39,0],[42,0,44,0],[47,0,49,0],[52,0,54,0],[7,0,9,0],[12,0,14,0],[17,0,19,0],[22,0,24,0],[27,0,29,0],[32,0,34,0]]}
["date",{"$f":"'Scoring criteria'!E2","v":"2011-07-29"}]
["date + 6 months",{"$f":"EDATE(B1,6)","v":"2012-01-29"}]
["date + 1 year",{"$f":"EDATE(B1,12)","v":"2012-07-29"}]
["date + 2 years",{"$f":"EDATE(B1,24)","v":"2013-07-29"}]
[]
[]
["Section","Percentage loss + 6 months",null,"Percentage loss+1year",null,"Percentage loss+2years"]
["Central Unit and communication",{"$f":"IF('Scoring criteria'!F158<=B2,'Scoring criteria'!G158,0)","v":0},null,{"$f":"IF('Scoring criteria'!F158 <=B3,'Scoring criteria'!G158,0)","v":0},null,{"$f":"IF('Scoring criteria'!F158 <=B4,'Scoring criteria'!G158,0)","v":0}]
[null,{"$f":"IF('Scoring criteria'!F159<=B2,'Scoring criteria'!G159,0)","v":0},null,{"$f":"IF('Scoring criteria'!F159 <=B3,'Scoring criteria'!G159,0)","v":0},null,{"$f":"IF('Scoring criteria'!F159 <=B4,'Scoring criteria'!G159,0)","v":0}]
[null,{"$f":"IF('Scoring criteria'!F160<=B2,'Scoring criteria'!G160,0)","v":0},null,{"$f":"IF('Scoring criteria'!F160 <=B3,'Scoring criteria'!G160,0)","v":0},null,{"$f":"IF('Scoring criteria'!F160 <=B4,'Scoring criteria'!G160,0)","v":0}]
["total",{"$f":"IF(SUM(B8:B10)=0,0,SUM(B8:B10))","v":0},null,{"$f":"IF(SUM(D8:D10)=0,0,SUM(D8:D10))","v":0},null,{"$f":"IF(SUM(F8:F10)=0,0,SUM(F8:F10))","v":0}]
[]
["Intermediary level"]
[]
[]
["total",{"$f":"IF(AND('financial sheet'!B76<>\"NA\", 'financial sheet'!B78<>\"NA\"),(B26+B31)/2,IF('financial sheet'!B76=\"NA\",B31,B26))","v":0},null,{"$f":"IF(AND('financial sheet'!B76<>\"NA\", 'financial sheet'!B78<>\"NA\"),(D26+D31)/2,IF('financial sheet'!B76=\"NA\",D31,D26))","v":0},null,{"$f":"IF(AND('financial sheet'!B76<>\"NA\", 'financial sheet'!B78<>\"NA\"),(F26+F31)/2,IF('financial sheet'!B76=\"NA\",F31,F26))","v":0}]
[]
["Laboratories",{"$f":"IF('Scoring criteria'!F161<=B2,'Scoring criteria'!G161,0)","v":0},null,{"$f":"IF('Scoring criteria'!F161<=B3,'Scoring criteria'!G161,0)","v":0},null,{"$f":"IF('Scoring criteria'!F161<=B4,'Scoring criteria'!G161,0)","v":0}]
[null,{"$f":"IF('Scoring criteria'!F162<=B2,'Scoring criteria'!G162,0)","v":0},null,{"$f":"IF('Scoring criteria'!F162<=B3,'Scoring criteria'!G162,0)","v":0},null,{"$f":"IF('Scoring criteria'!F162<=B4,'Scoring criteria'!G162,0)","v":0}]
[null,{"$f":"IF('Scoring criteria'!F163<=B2,'Scoring criteria'!G163,0)","v":0},null,{"$f":"IF('Scoring criteria'!F163<=B3,'Scoring criteria'!G163,0)","v":0},null,{"$f":"IF('Scoring criteria'!F163<=B4,'Scoring criteria'!G163,0)","v":0}]
["total",{"$f":"IF(SUM(B18:B20)=0,0,SUM(B18:B20))","v":0},null,{"$f":"IF(SUM(D18:D20)=0,0,SUM(D18:D20))","v":0},null,{"$f":"IF(SUM(F18:F20)=0,0,SUM(F18:F20))","v":0}]
[]
["Passive surveillance",{"$f":"IF('Scoring criteria'!F164<=B2,'Scoring criteria'!G164,0)","v":0},null,{"$f":"IF('Scoring criteria'!F164<=B3,'Scoring criteria'!G164,0)","v":0},null,{"$f":"IF('Scoring criteria'!F164<=B4,'Scoring criteria'!G164,0)","v":0}]
[null,{"$f":"IF('Scoring criteria'!F165<=B2,'Scoring criteria'!G165,0)","v":0},null,{"$f":"IF('Scoring criteria'!F165<=B3,'Scoring criteria'!G165,0)","v":0},null,{"$f":"IF('Scoring criteria'!F165<=B4,'Scoring criteria'!G165,0)","v":0}]
[null,{"$f":"IF('Scoring criteria'!F166<=B2,'Scoring criteria'!G166,0)","v":0},null,{"$f":"IF('Scoring criteria'!F166<=B3,'Scoring criteria'!G166,0)","v":0},null,{"$f":"IF('Scoring criteria'!F166<=B4,'Scoring criteria'!G166,0)","v":0}]
["total",{"$f":"IF(SUM(B23:B25)=0,0,SUM(B23:B25))","v":0},null,{"$f":"IF(SUM(D23:D25)=0,0,SUM(D23:D25))","v":0},null,{"$f":"IF(SUM(F23:F25)=0,0,SUM(F23:F25))","v":0}]
[]
["Active surveillance",{"$f":"IF('Scoring criteria'!F167<=B2,'Scoring criteria'!G167,0)","v":0},null,{"$f":"IF('Scoring criteria'!F167<=B3,'Scoring criteria'!G167,0)","v":0},null,{"$f":"IF('Scoring criteria'!F167<=B4,'Scoring criteria'!G167,0)","v":0}]
[null,{"$f":"IF('Scoring criteria'!F168<=B2,'Scoring criteria'!G168,0)","v":0},null,{"$f":"IF('Scoring criteria'!F168<=B3,'Scoring criteria'!G168,0)","v":0},null,{"$f":"IF('Scoring criteria'!F168<=B4,'Scoring criteria'!G168,0)","v":0}]
[null,{"$f":"IF('Scoring criteria'!F169<=B2,'Scoring criteria'!G169,0)","v":0},null,{"$f":"IF('Scoring criteria'!F169<=B3,'Scoring criteria'!G169,0)","v":0},null,{"$f":"IF('Scoring criteria'!F169<=B4,'Scoring criteria'!G169,0)","v":0}]
["Total",{"$f":"IF(SUM(B28:B30)=0,0,SUM(B28:B30))","v":0},null,{"$f":"IF(SUM(D28:D30)=0,0,SUM(D28:D30))","v":0},null,{"$f":"IF(SUM(F28:F30)=0,0,SUM(F28:F30))","v":0}]
[]
["Specific surveillance",{"$f":"IF('Scoring criteria'!F170<=B2,'Scoring criteria'!G170,0)","v":0},null,{"$f":"IF('Scoring criteria'!F170<=B3,'Scoring criteria'!G170,0)","v":0},null,{"$f":"IF('Scoring criteria'!F170<=B4,'Scoring criteria'!G170,0)","v":0}]
[null,{"$f":"IF('Scoring criteria'!F171<=B2,'Scoring criteria'!G171,0)","v":0},null,{"$f":"IF('Scoring criteria'!F171<=B3,'Scoring criteria'!G171,0)","v":0},null,{"$f":"IF('Scoring criteria'!F171<=B4,'Scoring criteria'!G171,0)","v":0}]
[null,{"$f":"IF('Scoring criteria'!F172<=B2,'Scoring criteria'!G172,0)","v":0},null,{"$f":"IF('Scoring criteria'!F172<=B3,'Scoring criteria'!G172,0)","v":0},null,{"$f":"IF('Scoring criteria'!F172<=B4,'Scoring criteria'!G172,0)","v":0}]
["total",{"$f":"IF(SUM(B33:B35)=0,0,SUM(B33:B35))","v":0},null,{"$f":"IF(SUM(D33:D35)=0,0,SUM(D33:D35))","v":0},null,{"$f":"IF(SUM(F33:F35)=0,0,SUM(F33:F35))","v":0}]
[]
["data management: Data entry",{"$f":"IF('Scoring criteria'!F178<=B2,'Scoring criteria'!E178,0)","v":0},null,{"$f":"IF('Scoring criteria'!F178 <=B3,'Scoring criteria'!E178,0)","v":0},null,{"$f":"IF('Scoring criteria'!F178 <=B4,'Scoring criteria'!E178,0)","v":0}]
[null,{"$f":"IF('Scoring criteria'!F179<=B2,'Scoring criteria'!E179,0)","v":0},null,{"$f":"IF('Scoring criteria'!F179 <=B3,'Scoring criteria'!E179,0)","v":0},null,{"$f":"IF('Scoring criteria'!F179 <=B4,'Scoring criteria'!E179,0)","v":0}]
[null,{"$f":"IF('Scoring criteria'!F180<=B2,'Scoring criteria'!E180,0)","v":0},null,{"$f":"IF('Scoring criteria'!F180 <=B3,'Scoring criteria'!E180,0)","v":0},null,{"$f":"IF('Scoring criteria'!F180 <=B4,'Scoring criteria'!E180,0)","v":0}]
["total",{"$f":"IF(SUM(B38:B40)=0,0,SUM(B38:B40))","v":0},null,{"$f":"IF(SUM(D38:D40)=0,0,SUM(D38:D40))","v":0},null,{"$f":"IF(SUM(F38:F40)=0,0,SUM(F38:F40))","v":0}]
[]
["data management: data validation ",{"$f":"IF('Scoring criteria'!F181<=B2,'Scoring criteria'!E181,0)","v":0},null,{"$f":"IF('Scoring criteria'!F181 <=B3,'Scoring criteria'!E181,0)","v":0},null,{"$f":"IF('Scoring criteria'!F181 <=B4,'Scoring criteria'!E181,0)","v":0}]
[null,{"$f":"IF('Scoring criteria'!F182<=B2,'Scoring criteria'!E182,0)","v":0},null,{"$f":"IF('Scoring criteria'!F182 <=B3,'Scoring criteria'!E182,0)","v":0},null,{"$f":"IF('Scoring criteria'!F182 <=B4,'Scoring criteria'!E182,0)","v":0}]
[null,{"$f":"IF('Scoring criteria'!F183<=B2,'Scoring criteria'!E183,0)","v":0},null,{"$f":"IF('Scoring criteria'!F183 <=B3,'Scoring criteria'!E183,0)","v":0},null,{"$f":"IF('Scoring criteria'!F183 <=B4,'Scoring criteria'!E183,0)","v":0}]
["total",{"$f":"IF(SUM(B43:B45)=0,0,SUM(B43:B45))","v":0},null,{"$f":"IF(SUM(D43:D45)=0,0,SUM(D43:D45))","v":0},null,{"$f":"IF(SUM(F43:F45)=0,0,SUM(F43:F45))","v":0}]
[]
["data management: data analysis ",{"$f":"IF('Scoring criteria'!F184<=B2,'Scoring criteria'!E184,0)","v":0},null,{"$f":"IF('Scoring criteria'!F184 <=B3,'Scoring criteria'!E184,0)","v":0},null,{"$f":"IF('Scoring criteria'!F184 <=B4,'Scoring criteria'!E184,0)","v":0}]
[null,{"$f":"IF('Scoring criteria'!F185<=B2,'Scoring criteria'!E185,0)","v":0},null,{"$f":"IF('Scoring criteria'!F185 <=B3,'Scoring criteria'!E185,0)","v":0},null,{"$f":"IF('Scoring criteria'!F185 <=B4,'Scoring criteria'!E185,0)","v":0}]
[null,{"$f":"IF('Scoring criteria'!F186<=B2,'Scoring criteria'!E186,0)","v":0},null,{"$f":"IF('Scoring criteria'!F186 <=B3,'Scoring criteria'!E186,0)","v":0},null,{"$f":"IF('Scoring criteria'!F186 <=B4,'Scoring criteria'!E186,0)","v":0}]
["total",{"$f":"IF(SUM(B48:B50)=0,0,SUM(B48:B50))","v":0},null,{"$f":"IF(SUM(D48:D50)=0,0,SUM(D48:D50))","v":0},null,{"$f":"IF(SUM(F48:F50)=0,0,SUM(F48:F50))","v":0}]
[]
["Evaluation",{"$f":"IF('Scoring criteria'!F173<=B2,'Scoring criteria'!G173,0)","v":0},null,{"$f":"IF('Scoring criteria'!F173<=B3,'Scoring criteria'!G173,0)","v":0},null,{"$f":"IF('Scoring criteria'!F173<=B4,'Scoring criteria'!G173,0)","v":0}]
[null,{"$f":"IF('Scoring criteria'!F174<=B2,'Scoring criteria'!G174,0)","v":0},null,{"$f":"IF('Scoring criteria'!F174<=B3,'[1]Scoring criteria'!G174,0)","v":0},null,{"$f":"IF('Scoring criteria'!F174<=B4,'Scoring criteria'!G174,0)","v":0}]
[null,{"$f":"IF('Scoring criteria'!F175<=B2,'Scoring criteria'!G175,0)","v":0},null,{"$f":"IF('Scoring criteria'!F175<=B3,'Scoring criteria'!G175,0)","v":0},null,{"$f":"IF('Scoring criteria'!F175<=B4,'Scoring criteria'!G175,0)","v":0}]
["total",{"$f":"IF(SUM(B53:B55)=0,0,SUM(B53:B55))","v":0},null,{"$f":"IF(SUM(D53:D55)=0,0,SUM(D53:D55))","v":0},null,{"$f":"IF(SUM(F53:F55)=0,0,SUM(F53:F55))","v":0}]

{"sheet":"Resume","index":14,"n_rows":40,"n_cols":6,"rows_kept":40,"cut":false,"hidden":false,"merged":[[36,0,39,0],[36,1,39,1],[25,2,25,5],[26,2,26,5],[29,0,32,0],[29,1,32,1],[16,4,17,4],[18,4,19,4],[22,1,23,1],[16,0,23,0],[0,0,0,1],[6,0,7,0],[10,0,12,0],[16,1,17,1],[18,1,19,1],[20,1,21,1]]}
["Resume of the evaluation "]
[]
["Generalities"]
[]
["Network",{"$f":"'Scoring criteria'!H3","v":0}]
["Date of the assessment",{"$f":"'Scoring criteria'!E2","v":"2011-07-29"}]
["Person who has implement the questionnaires","Name",{"$f":"'Scoring criteria'!E3","v":0}]
[null,"Function ",{"$f":"'Scoring criteria'!E4","v":0}]
[]
[null,"Name","Function"]
["Persons who have implement the scoring",{"$f":"IF(ISBLANK('Scoring criteria'!G5),\"/\",'Scoring criteria'!G5)","v":"name"},{"$f":"IF(ISBLANK('Scoring criteria'!H5),\"/\",'Scoring criteria'!H5)","v":"/"}]
[null,{"$f":"IF(ISBLANK('Scoring criteria'!G6),\"/\",'Scoring criteria'!G6)","v":"name"},{"$f":"IF(ISBLANK('Scoring criteria'!H6),\"/\",'Scoring criteria'!H6)","v":"/"}]
[null,{"$f":"IF(ISBLANK('Scoring criteria'!G7),\"/\",'Scoring criteria'!G7)","v":"/"},{"$f":"IF(ISBLANK('Scoring criteria'!H7),\"/\",'Scoring criteria'!H7)","v":"/"}]
[]
["Questionnaires"]
[{"$nulls":4},"minimal sample"]
["Number of people who had been interviewed","field agents","active and passive surveillance",{"$f":"'Scoring criteria'!F188","v":0},{"$f":"IF(OR('[1]Scoring criteria'!E89=\"NA\",'[1]Scoring criteria'!E89=0),0,5)","v":5}]
[null,null,"only passive surveillance",{"$f":"'Scoring criteria'!F189","v":5}]
[null,"intermediary units - supervision of field agents","active and passive surveillance",{"$f":"'Scoring criteria'!F190","v":0},3]
[null,null,"only passive surveillance",{"$f":"'Scoring criteria'!F191","v":3}]
[null,"Central Unit","Coordinator",{"$f":"'Scoring criteria'!F192","v":1},1]
[null,null,"Other",{"$f":"'Scoring criteria'!F193","v":1},1]
[null,"Laboratories","Central laboratory",{"$f":"'Scoring criteria'!F194","v":1},1]
[null,null,"Local laboratories",{"$f":"'Scoring criteria'!F195","v":"NA"},1]
[]
[null,"Name","Evaluation of the parameter"]
["Number of missing answers ",{"$f":"B11","v":"name"},{"$f":"IF('Scoring criteria'!E143=3,\"No answer is missing. The questionnaire is complete\",IF('Scoring criteria'!E143=2,\"Few answers are missing\",IF('Scoring criteria'!E143=1,\"lot of answers are missing and it’s an important problem to score criteria\",IF('Scoring criteria'!E143=0,\"lot of answers are missing and it’s an important problem to score criteria\"))))","v":"Few answers are missing"}]
[]
[null,null,null,"Intermediary units","Field agents","Laboratories"]
["Heterogeneity of anwers","Average Number of questions with answers","Very homogeneous",{"$f":"'Scoring criteria'!E144","v":32},{"$f":"'Scoring criteria'!E148","v":29},{"$f":"'Scoring criteria'!E152","v":"NA"}]
[null,null,"Fairly homogeneous",{"$f":"'Scoring criteria'!E145","v":"NA"},{"$f":"'Scoring criteria'!E149","v":8},{"$f":"'Scoring criteria'!E153","v":"NA"}]
[null,null,"Not homogeneous but homogeneous per each category of actors ",{"$f":"'Scoring criteria'!E146","v":"NA"},{"$f":"'Scoring criteria'!E150","v":"NA"},{"$f":"'Scoring criteria'!E154","v":"NA"}]
[null,null,"Not homogenous",{"$f":"'Scoring criteria'!E147","v":6},{"$f":"'Scoring criteria'!E151","v":6},{"$f":"'Scoring criteria'!E155","v":"NA"}]
[]
["Scoring"]
[]
["Heterogeneity of scores between persons in charge of scoring","Number of criteria with standar deviation of ",0,{"$f":"SDscore!E81","v":63}]
[null,null,"0< SD < 0,6",{"$f":"SDscore!F81","v":1}]
[null,null,"0,6 =< SD <=1",{"$f":"SDscore!G81","v":7}]
[null,null,"SD > 1",{"$f":"SDscore!H81","v":7}]

{"sheet":"SDscore","index":15,"n_rows":81,"n_cols":8,"rows_kept":81,"cut":false,"hidden":true,"merged":[]}
[]
["score1","score2","score3","Standar deviation","SD = 0","0<SD<0,6","0,6=<SD=<1","1<DS"]
[{"$f":"IF('Scoring criteria'!B15=\"NA\", -1,IF(ISBLANK('Scoring criteria'!B15),\"\",'Scoring criteria'!B15))","v":3},{"$f":"IF('Scoring criteria'!C15=\"NA\", -1,IF(ISBLANK('Scoring criteria'!C15),\"\",'Scoring criteria'!C15))","v":3},{"$f":"IF('Scoring criteria'!D15=\"NA\", -1,IF(ISBLANK('Scoring criteria'!D15),\"\",'Scoring criteria'!D15))","v":""},{"$f":"IF(AND(A3=-1,B3=-1,C3=-1),0,STDEV(A3,B3,C3))","v":0},{"$f":"IF(D3=0,1,0)","v":1},{"$f":"IF(AND(0<D3, D3<0.6),1,0)","v":0},{"$f":"IF(AND(0.6<=D3,D3<=1),1,0)","v":0},{"$f":"IF(D3>1,1,0)","v":0}]
[{"$f":"IF('Scoring criteria'!B16=\"NA\", -1,IF(ISBLANK('Scoring criteria'!B16),\"\",'Scoring criteria'!B16))","v":3},{"$f":"IF('Scoring criteria'!C16=\"NA\", -1,IF(ISBLANK('Scoring criteria'!C16),\"\",'Scoring criteria'!C16))","v":3},{"$f":"IF('Scoring criteria'!D16=\"NA\", -1,IF(ISBLANK('Scoring criteria'!D16),\"\",'Scoring criteria'!D16))","v":""},{"$f":"IF(AND(A4=-1,B4=-1,C4=-1),0,STDEV(A4,B4,C4))","v":0},1,0,0,0]
[{"$f":"IF('Scoring criteria'!B17=\"NA\", -1,IF(ISBLANK('Scoring criteria'!B17),\"\",'Scoring criteria'!B17))","v":3},{"$f":"IF('Scoring criteria'!C17=\"NA\", -1,IF(ISBLANK('Scoring criteria'!C17),\"\",'Scoring criteria'!C17))","v":3},{"$f":"IF('Scoring criteria'!D17=\"NA\", -1,IF(ISBLANK('Scoring criteria'!D17),\"\",'Scoring criteria'!D17))","v":""},0,1,0,0,0]
[{"$f":"IF('Scoring criteria'!B18=\"NA\", -1,IF(ISBLANK('Scoring criteria'!B18),\"\",'Scoring criteria'!B18))","v":3},{"$f":"IF('Scoring criteria'!C18=\"NA\", -1,IF(ISBLANK('Scoring criteria'!C18),\"\",'Scoring criteria'!C18))","v":3},{"$f":"IF('Scoring criteria'!D18=\"NA\", -1,IF(ISBLANK('Scoring criteria'!D18),\"\",'Scoring criteria'!D18))","v":""},0,1,0,0,0]
[{"$f":"IF('Scoring criteria'!B24=\"NA\", -1,IF(ISBLANK('Scoring criteria'!B24),\"\",'Scoring criteria'!B24))","v":0},{"$f":"IF('Scoring criteria'!C24=\"NA\", -1,IF(ISBLANK('Scoring criteria'!C24),\"\",'Scoring criteria'!C24))","v":1},{"$f":"IF('Scoring criteria'!D24=\"NA\", -1,IF(ISBLANK('Scoring criteria'!D24),\"\",'Scoring criteria'!D24))","v":""},0.70710678118654757,0,0,1,0]
[{"$f":"IF('Scoring criteria'!B25=\"NA\", -1,IF(ISBLANK('Scoring criteria'!B25),\"\",'Scoring criteria'!B25))","v":1},{"$f":"IF('Scoring criteria'!C25=\"NA\", -1,IF(ISBLANK('Scoring criteria'!C25),\"\",'Scoring criteria'!C25))","v":1},{"$f":"IF('Scoring criteria'!D25=\"NA\", -1,IF(ISBLANK('Scoring criteria'!D25),\"\",'Scoring criteria'!D25))","v":""},0,1,0,0,0]
[{"$f":"IF('Scoring criteria'!B26=\"NA\", -1,IF(ISBLANK('Scoring criteria'!B26),\"\",'Scoring criteria'!B26))","v":2},{"$f":"IF('Scoring criteria'!C26=\"NA\", -1,IF(ISBLANK('Scoring criteria'!C26),\"\",'Scoring criteria'!C26))","v":2},{"$f":"IF('Scoring criteria'!D26=\"NA\", -1,IF(ISBLANK('Scoring criteria'!D26),\"\",'Scoring criteria'!D26))","v":""},0,1,0,0,0]
[{"$f":"IF('Scoring criteria'!B27=\"NA\", -1,IF(ISBLANK('Scoring criteria'!B27),\"\",'Scoring criteria'!B27))","v":0},{"$f":"IF('Scoring criteria'!C27=\"NA\", -1,IF(ISBLANK('Scoring criteria'!C27),\"\",'Scoring criteria'!C27))","v":0},{"$f":"IF('Scoring criteria'!D27=\"NA\", -1,IF(ISBLANK('Scoring criteria'!D27),\"\",'Scoring criteria'!D27))","v":""},0,1,0,0,0]
[{"$f":"IF('Scoring criteria'!B28=\"NA\", -1,IF(ISBLANK('Scoring criteria'!B28),\"\",'Scoring criteria'!B28))","v":2},{"$f":"IF('Scoring criteria'!C28=\"NA\", -1,IF(ISBLANK('Scoring criteria'!C28),\"\",'Scoring criteria'!C28))","v":2},{"$f":"IF('Scoring criteria'!D28=\"NA\", -1,IF(ISBLANK('Scoring criteria'!D28),\"\",'Scoring criteria'!D28))","v":""},0,1,0,0,0]
[{"$f":"IF('Scoring criteria'!B29=\"NA\", -1,IF(ISBLANK('Scoring criteria'!B29),\"\",'Scoring criteria'!B29))","v":2},{"$f":"IF('Scoring criteria'!C29=\"NA\", -1,IF(ISBLANK('Scoring criteria'!C29),\"\",'Scoring criteria'!C29))","v":2},{"$f":"IF('Scoring criteria'!D29=\"NA\", -1,IF(ISBLANK('Scoring criteria'!D29),\"\",'Scoring criteria'!D29))","v":""},0,1,0,0,0]
[{"$f":"IF('Scoring criteria'!B30=\"NA\", -1,IF(ISBLANK('Scoring criteria'!B30),\"\",'Scoring criteria'!B30))","v":0},{"$f":"IF('Scoring criteria'!C30=\"NA\", -1,IF(ISBLANK('Scoring criteria'!C30),\"\",'Scoring criteria'!C30))","v":0},{"$f":"IF('Scoring criteria'!D30=\"NA\", -1,IF(ISBLANK('Scoring criteria'!D30),\"\",'Scoring criteria'!D30))","v":""},0,1,0,0,0]
[{"$f":"IF('Scoring criteria'!B36=\"NA\", -1,IF(ISBLANK('Scoring criteria'!B36),\"\",'Scoring criteria'!B36))","v":3},{"$f":"IF('Scoring criteria'!C36=\"NA\", -1,IF(ISBLANK('Scoring criteria'!C36),\"\",'Scoring criteria'!C36))","v":3},{"$f":"IF('Scoring criteria'!D36=\"NA\", -1,IF(ISBLANK('Scoring criteria'!D36),\"\",'Scoring criteria'!D36))","v":""},0,1,0,0,0]
[{"$f":"IF('Scoring criteria'!B37=\"NA\", -1,IF(ISBLANK('Scoring criteria'!B37),\"\",'Scoring criteria'!B37))","v":3},{"$f":"IF('Scoring criteria'!C37=\"NA\", -1,IF(ISBLANK('Scoring criteria'!C37),\"\",'Scoring criteria'!C37))","v":3},{"$f":"IF('Scoring criteria'!D37=\"NA\", -1,IF(ISBLANK('Scoring criteria'!D37),\"\",'Scoring criteria'!D37))","v":""},0,1,0,0,0]
[{"$f":"IF('Scoring criteria'!B38=\"NA\", -1,IF(ISBLANK('Scoring criteria'!B38),\"\",'Scoring criteria'!B38))","v":3},{"$f":"IF('Scoring criteria'!C38=\"NA\", -1,IF(ISBLANK('Scoring criteria'!C38),\"\",'Scoring criteria'!C38))","v":2.5},{"$f":"IF('Scoring criteria'!D38=\"NA\", -1,IF(ISBLANK('Scoring criteria'!D38),\"\",'Scoring criteria'!D38))","v":""},0.35355339059327379,0,1,0,0]
[{"$f":"IF('Scoring criteria'!B39=\"NA\", -1,IF(ISBLANK('Scoring criteria'!B39),\"\",'Scoring criteria'!B39))","v":0},{"$f":"IF('Scoring criteria'!C39=\"NA\", -1,IF(ISBLANK('Scoring criteria'!C39),\"\",'Scoring criteria'!C39))","v":0},{"$f":"IF('Scoring criteria'!D39=\"NA\", -1,IF(ISBLANK('Scoring criteria'!D39),\"\",'Scoring criteria'!D39))","v":""},0,1,0,0,0]
[{"$f":"IF('Scoring criteria'!B40=\"NA\", -1,IF(ISBLANK('Scoring criteria'!B40),\"\",'Scoring criteria'!B40))","v":0},{"$f":"IF('Scoring criteria'!C40=\"NA\", -1,IF(ISBLANK('Scoring criteria'!C40),\"\",'Scoring criteria'!C40))","v":0},{"$f":"IF('Scoring criteria'!D40=\"NA\", -1,IF(ISBLANK('Scoring criteria'!D40),\"\",'Scoring criteria'!D40))","v":""},0,1,0,0,0]
[{"$f":"IF('Scoring criteria'!B41=\"NA\", -1,IF(ISBLANK('Scoring criteria'!B41),\"\",'Scoring criteria'!B41))","v":1},{"$f":"IF('Scoring criteria'!C41=\"NA\", -1,IF(ISBLANK('Scoring criteria'!C41),\"\",'Scoring criteria'!C41))","v":3},{"$f":"IF('Scoring criteria'!D41=\"NA\", -1,IF(ISBLANK('Scoring criteria'!D41),\"\",'Scoring criteria'!D41))","v":""},1.4142135623730951,0,0,0,1]
[{"$f":"IF('Scoring criteria'!B42=\"NA\", -1,IF(ISBLANK('Scoring criteria'!B42),\"\",'Scoring criteria'!B42))","v":3},{"$f":"IF('Scoring criteria'!C42=\"NA\", -1,IF(ISBLANK('Scoring criteria'!C42),\"\",'Scoring criteria'!C42))","v":1},{"$f":"IF('Scoring criteria'!D42=\"NA\", -1,IF(ISBLANK('Scoring criteria'!D42),\"\",'Scoring criteria'!D42))","v":""},1.4142135623730951,0,0,0,1]
[{"$f":"IF('Scoring criteria'!B43=\"NA\", -1,IF(ISBLANK('Scoring criteria'!B43),\"\",'Scoring criteria'!B43))","v":0},{"$f":"IF('Scoring criteria'!C43=\"NA\", -1,IF(ISBLANK('Scoring criteria'!C43),\"\",'Scoring criteria'!C43))","v":0},{"$f":"IF('Scoring criteria'!D43=\"NA\", -1,IF(ISBLANK('Scoring criteria'!D43),\"\",'Scoring criteria'!D43))","v":""},0,1,0,0,0]
[{"$f":"IF('Scoring criteria'!B49=\"NA\", -1,IF(ISBLANK('Scoring criteria'!B49),\"\",'Scoring criteria'!B49))","v":3},{"$f":"IF('Scoring criteria'!C49=\"NA\", -1,IF(ISBLANK('Scoring criteria'!C49),\"\",'Scoring criteria'!C49))","v":3},{"$f":"IF('Scoring criteria'!D49=\"NA\", -1,IF(ISBLANK('Scoring criteria'!D49),\"\",'Scoring criteria'!D49))","v":""},0,1,0,0,0]
[{"$f":"IF('Scoring criteria'!B50=\"NA\", -1,IF(ISBLANK('Scoring criteria'!B50),\"\",'Scoring criteria'!B50))","v":0},{"$f":"IF('Scoring criteria'!C50=\"NA\", -1,IF(ISBLANK('Scoring criteria'!C50),\"\",'Scoring criteria'!C50))","v":0},{"$f":"IF('Scoring criteria'!D50=\"NA\", -1,IF(ISBLANK('Scoring criteria'!D50),\"\",'Scoring criteria'!D50))","v":""},0,1,0,0,0]
[{"$f":"IF('Scoring criteria'!B51=\"NA\", -1,IF(ISBLANK('Scoring criteria'!B51),\"\",'Scoring criteria'!B51))","v":3},{"$f":"IF('Scoring criteria'!C51=\"NA\", -1,IF(ISBLANK('Scoring criteria'!C51),\"\",'Scoring criteria'!C51))","v":3},{"$f":"IF('Scoring criteria'!D51=\"NA\", -1,IF(ISBLANK('Scoring criteria'!D51),\"\",'Scoring criteria'!D51))","v":""},0,1,0,0,0]
[{"$f":"IF('Scoring criteria'!B52=\"NA\", -1,IF(ISBLANK('Scoring criteria'!B52),\"\",'Scoring criteria'!B52))","v":3},{"$f":"IF('Scoring criteria'!C52=\"NA\", -1,IF(ISBLANK('Scoring criteria'!C52),\"\",'Scoring criteria'!C52))","v":3},{"$f":"IF('Scoring criteria'!D52=\"NA\", -1,IF(ISBLANK('Scoring criteria'!D52),\"\",'Scoring criteria'!D52))","v":""},0,1,0,0,0]
[{"$f":"IF('Scoring criteria'!B53=\"NA\", -1,IF(ISBLANK('Scoring criteria'!B53),\"\",'Scoring criteria'!B53))","v":3},{"$f":"IF('Scoring criteria'!C53=\"NA\", -1,IF(ISBLANK('Scoring criteria'!C53),\"\",'Scoring criteria'!C53))","v":3},{"$f":"IF('Scoring criteria'!D53=\"NA\", -1,IF(ISBLANK('Scoring criteria'!D53),\"\",'Scoring criteria'!D53))","v":""},0,1,0,0,0]
[{"$f":"IF('Scoring criteria'!B54=\"NA\", -1,IF(ISBLANK('Scoring criteria'!B54),\"\",'Scoring criteria'!B54))","v":2},{"$f":"IF('Scoring criteria'!C54=\"NA\", -1,IF(ISBLANK('Scoring criteria'!C54),\"\",'Scoring criteria'!C54))","v":2},{"$f":"IF('Scoring criteria'!D54=\"NA\", -1,IF(ISBLANK('Scoring criteria'!D54),\"\",'Scoring criteria'!D54))","v":""},0,1,0,0,0]
[{"$f":"IF('Scoring criteria'!B55=\"NA\", -1,IF(ISBLANK('Scoring criteria'!B55),\"\",'Scoring criteria'!B55))","v":3},{"$f":"IF('Scoring criteria'!C55=\"NA\", -1,IF(ISBLANK('Scoring criteria'!C55),\"\",'Scoring criteria'!C55))","v":3},{"$f":"IF('Scoring criteria'!D55=\"NA\", -1,IF(ISBLANK('Scoring criteria'!D55),\"\",'Scoring criteria'!D55))","v":""},0,1,0,0,0]
[{"$f":"IF('Scoring criteria'!B56=\"NA\", -1,IF(ISBLANK('Scoring criteria'!B56),\"\",'Scoring criteria'!B56))","v":0},{"$f":"IF('Scoring criteria'!C56=\"NA\", -1,IF(ISBLANK('Scoring criteria'!C56),\"\",'Scoring criteria'!C56))","v":3},{"$f":"IF('Scoring criteria'!D56=\"NA\", -1,IF(ISBLANK('Scoring criteria'!D56),\"\",'Scoring criteria'!D56))","v":""},2.1213203435596424,0,0,0,1]
[{"$f":"IF('Scoring criteria'!B57=\"NA\", -1,IF(ISBLANK('Scoring criteria'!B57),\"\",'Scoring criteria'!B57))","v":0},{"$f":"IF('Scoring criteria'!C57=\"NA\", -1,IF(ISBLANK('Scoring criteria'!C57),\"\",'Scoring criteria'!C57))","v":3},{"$f":"IF('Scoring criteria'!D57=\"NA\", -1,IF(ISBLANK('Scoring criteria'!D57),\"\",'Scoring criteria'!D57))","v":""},2.1213203435596424,0,0,0,1]
[{"$f":"IF('Scoring criteria'!B58=\"NA\", -1,IF(ISBLANK('Scoring criteria'!B58),\"\",'Scoring criteria'!B58))","v":3},{"$f":"IF('Scoring criteria'!C58=\"NA\", -1,IF(ISBLANK('Scoring criteria'!C58),\"\",'Scoring criteria'!C58))","v":3},{"$f":"IF('Scoring criteria'!D58=\"NA\", -1,IF(ISBLANK('Scoring criteria'!D58),\"\",'Scoring criteria'!D58))","v":""},0,1,0,0,0]
[{"$f":"IF('Scoring criteria'!B59=\"NA\", -1,IF(ISBLANK('Scoring criteria'!B59),\"\",'Scoring criteria'!B59))","v":0},{"$f":"IF('Scoring criteria'!C59=\"NA\", -1,IF(ISBLANK('Scoring criteria'!C59),\"\",'Scoring criteria'!C59))","v":3},{"$f":"IF('Scoring criteria'!D59=\"NA\", -1,IF(ISBLANK('Scoring criteria'!D59),\"\",'Scoring criteria'!D59))","v":""},2.1213203435596424,0,0,0,1]
[{"$f":"IF('Scoring criteria'!B60=\"NA\", -1,IF(ISBLANK('Scoring criteria'!B60),\"\",'Scoring criteria'!B60))","v":0},{"$f":"IF('Scoring criteria'!C60=\"NA\", -1,IF(ISBLANK('Scoring criteria'!C60),\"\",'Scoring criteria'!C60))","v":0},{"$f":"IF('Scoring criteria'!D60=\"NA\", -1,IF(ISBLANK('Scoring criteria'!D60),\"\",'Scoring criteria'!D60))","v":""},0,1,0,0,0]
[{"$f":"IF('Scoring criteria'!B61=\"NA\", -1,IF(ISBLANK('Scoring criteria'!B61),\"\",'Scoring criteria'!B61))","v":3},{"$f":"IF('Scoring criteria'!C61=\"NA\", -1,IF(ISBLANK('Scoring criteria'!C61),\"\",'Scoring criteria'!C61))","v":3},{"$f":"IF('Scoring criteria'!D61=\"NA\", -1,IF(ISBLANK('Scoring criteria'!D61),\"\",'Scoring criteria'!D61))","v":""},0,1,0,0,0]
[{"$f":"IF('Scoring criteria'!B67=\"NA\", -1,IF(ISBLANK('Scoring criteria'!B67),\"\",'Scoring criteria'!B67))","v":2},{"$f":"IF('Scoring criteria'!C67=\"NA\", -1,IF(ISBLANK('Scoring criteria'!C67),\"\",'Scoring criteria'!C67))","v":2},{"$f":"IF('Scoring criteria'!D67=\"NA\", -1,IF(ISBLANK('Scoring criteria'!D67),\"\",'Scoring criteria'!D67))","v":""},0,1,0,0,0]
[{"$f":"IF('Scoring criteria'!B68=\"NA\", -1,IF(ISBLANK('Scoring criteria'!B68),\"\",'Scoring criteria'!B68))","v":3},{"$f":"IF('Scoring criteria'!C68=\"NA\", -1,IF(ISBLANK('Scoring criteria'!C68),\"\",'Scoring criteria'!C68))","v":3},{"$f":"IF('Scoring criteria'!D68=\"NA\", -1,IF(ISBLANK('Scoring criteria'!D68),\"\",'Scoring criteria'!D68))","v":""},0,1,0,0,0]
[{"$f":"IF('Scoring criteria'!B69=\"NA\", -1,IF(ISBLANK('Scoring criteria'!B69),\"\",'Scoring criteria'!B69))","v":3},{"$f":"IF('Scoring criteria'!C69=\"NA\", -1,IF(ISBLANK('Scoring criteria'!C69),\"\",'Scoring criteria'!C69))","v":3},{"$f":"IF('Scoring criteria'!D69=\"NA\", -1,IF(ISBLANK('Scoring criteria'!D69),\"\",'Scoring criteria'!D69))","v":""},0,1,0,0,0]
[{"$f":"IF('Scoring criteria'!B70=\"NA\", -1,IF(ISBLANK('Scoring criteria'!B70),\"\",'Scoring criteria'!B70))","v":3},{"$f":"IF('Scoring criteria'!C70=\"NA\", -1,IF(ISBLANK('Scoring criteria'!C70),\"\",'Scoring criteria'!C70))","v":3},{"$f":"IF('Scoring criteria'!D70=\"NA\", -1,IF(ISBLANK('Scoring criteria'!D70),\"\",'Scoring criteria'!D70))","v":""},0,1,0,0,0]
[{"$f":"IF('Scoring criteria'!B71=\"NA\", -1,IF(ISBLANK('Scoring criteria'!B71),\"\",'Scoring criteria'!B71))","v":2},{"$f":"IF('Scoring criteria'!C71=\"NA\", -1,IF(ISBLANK('Scoring criteria'!C71),\"\",'Scoring criteria'!C71))","v":1},{"$f":"IF('Scoring criteria'!D71=\"NA\", -1,IF(ISBLANK('Scoring criteria'!D71),\"\",'Scoring criteria'!D71))","v":""},0.70710678118654757,0,0,1,0]
[{"$f":"IF('Scoring criteria'!B72=\"NA\", -1,IF(ISBLANK('Scoring criteria'!B72),\"\",'Scoring criteria'!B72))","v":2},{"$f":"IF('Scoring criteria'!C72=\"NA\", -1,IF(ISBLANK('Scoring criteria'!C72),\"\",'Scoring criteria'!C72))","v":2},{"$f":"IF('Scoring criteria'!D72=\"NA\", -1,IF(ISBLANK('Scoring criteria'!D72),\"\",'Scoring criteria'!D72))","v":""},0,1,0,0,0]
[{"$f":"IF('Scoring criteria'!B73=\"NA\", -1,IF(ISBLANK('Scoring criteria'!B73),\"\",'Scoring criteria'!B73))","v":3},{"$f":"IF('Scoring criteria'!C73=\"NA\", -1,IF(ISBLANK('Scoring criteria'!C73),\"\",'Scoring criteria'!C73))","v":3},{"$f":"IF('Scoring criteria'!D73=\"NA\", -1,IF(ISBLANK('Scoring criteria'!D73),\"\",'Scoring criteria'!D73))","v":""},0,1,0,0,0]
[{"$f":"IF('Scoring criteria'!B74=\"NA\", -1,IF(ISBLANK('Scoring criteria'!B74),\"\",'Scoring criteria'!B74))","v":3},{"$f":"IF('Scoring criteria'!C74=\"NA\", -1,IF(ISBLANK('Scoring criteria'!C74),\"\",'Scoring criteria'!C74))","v":2},{"$f":"IF('Scoring criteria'!D74=\"NA\", -1,IF(ISBLANK('Scoring criteria'!D74),\"\",'Scoring criteria'!D74))","v":""},0.70710678118654757,0,0,1,0]
[{"$f":"IF('Scoring criteria'!B75=\"NA\", -1,IF(ISBLANK('Scoring criteria'!B75),\"\",'Scoring criteria'!B75))","v":3},{"$f":"IF('Scoring criteria'!C75=\"NA\", -1,IF(ISBLANK('Scoring criteria'!C75),\"\",'Scoring criteria'!C75))","v":3},{"$f":"IF('Scoring criteria'!D75=\"NA\", -1,IF(ISBLANK('Scoring criteria'!D75),\"\",'Scoring criteria'!D75))","v":""},0,1,0,0,0]
[{"$f":"IF('Scoring criteria'!B76=\"NA\", -1,IF(ISBLANK('Scoring criteria'!B76),\"\",'Scoring criteria'!B76))","v":3},{"$f":"IF('Scoring criteria'!C76=\"NA\", -1,IF(ISBLANK('Scoring criteria'!C76),\"\",'Scoring criteria'!C76))","v":3},{"$f":"IF('Scoring criteria'!D76=\"NA\", -1,IF(ISBLANK('Scoring criteria'!D76),\"\",'Scoring criteria'!D76))","v":""},0,1,0,0,0]
[{"$f":"IF('Scoring criteria'!B77=\"NA\", -1,IF(ISBLANK('Scoring criteria'!B77),\"\",'Scoring criteria'!B77))","v":3},{"$f":"IF('Scoring criteria'!C77=\"NA\", -1,IF(ISBLANK('Scoring criteria'!C77),\"\",'Scoring criteria'!C77))","v":3},{"$f":"IF('Scoring criteria'!D77=\"NA\", -1,IF(ISBLANK('Scoring criteria'!D77),\"\",'Scoring criteria'!D77))","v":""},0,1,0,0,0]
[{"$f":"IF('Scoring criteria'!B78=\"NA\", -1,IF(ISBLANK('Scoring criteria'!B78),\"\",'Scoring criteria'!B78))","v":2},{"$f":"IF('Scoring criteria'!C78=\"NA\", -1,IF(ISBLANK('Scoring criteria'!C78),\"\",'Scoring criteria'!C78))","v":2},{"$f":"IF('Scoring criteria'!D78=\"NA\", -1,IF(ISBLANK('Scoring criteria'!D78),\"\",'Scoring criteria'!D78))","v":""},0,1,0,0,0]
[{"$f":"IF('Scoring criteria'!B79=\"NA\", -1,IF(ISBLANK('Scoring criteria'!B79),\"\",'Scoring criteria'!B79))","v":2},{"$f":"IF('Scoring criteria'!C79=\"NA\", -1,IF(ISBLANK('Scoring criteria'!C79),\"\",'Scoring criteria'!C79))","v":3},{"$f":"IF('Scoring criteria'!D79=\"NA\", -1,IF(ISBLANK('Scoring criteria'!D79),\"\",'Scoring criteria'!D79))","v":""},0.70710678118654757,0,0,1,0]
[{"$f":"IF('Scoring criteria'!B80=\"NA\", -1,IF(ISBLANK('Scoring criteria'!B80),\"\",'Scoring criteria'!B80))","v":2},{"$f":"IF('Scoring criteria'!C80=\"NA\", -1,IF(ISBLANK('Scoring criteria'!C80),\"\",'Scoring criteria'!C80))","v":1},{"$f":"IF('Scoring criteria'!D80=\"NA\", -1,IF(ISBLANK('Scoring criteria'!D80),\"\",'Scoring criteria'!D80))","v":""},0.70710678118654757,0,0,1,0]
[{"$f":"IF('Scoring criteria'!B86=\"NA\", -1,IF(ISBLANK('Scoring criteria'!B86),\"\",'Scoring criteria'!B86))","v":0},{"$f":"IF('Scoring criteria'!C86=\"NA\", -1,IF(ISBLANK('Scoring criteria'!C86),\"\",'Scoring criteria'!C86))","v":0},{"$f":"IF('Scoring criteria'!D86=\"NA\", -1,IF(ISBLANK('Scoring criteria'!D86),\"\",'Scoring criteria'!D86))","v":""},0,1,0,0,0]
[{"$f":"IF('Scoring criteria'!B87=\"NA\", -1,IF(ISBLANK('Scoring criteria'!B87),\"\",'Scoring criteria'!B87))","v":3},{"$f":"IF('Scoring criteria'!C87=\"NA\", -1,IF(ISBLANK('Scoring criteria'!C87),\"\",'Scoring criteria'!C87))","v":3},{"$f":"IF('Scoring criteria'!D87=\"NA\", -1,IF(ISBLANK('Scoring criteria'!D87),\"\",'Scoring criteria'!D87))","v":""},0,1,0,0,0]
[{"$f":"IF('Scoring criteria'!B88=\"NA\", -1,IF(ISBLANK('Scoring criteria'!B88),\"\",'Scoring criteria'!B88))","v":2},{"$f":"IF('Scoring criteria'!C88=\"NA\", -1,IF(ISBLANK('Scoring criteria'!C88),\"\",'Scoring criteria'!C88))","v":2},{"$f":"IF('Scoring criteria'!D88=\"NA\", -1,IF(ISBLANK('Scoring criteria'!D88),\"\",'Scoring criteria'!D88))","v":""},0,1,0,0,0]
[{"$f":"IF('Scoring criteria'!B89=\"NA\", -1,IF(ISBLANK('Scoring criteria'!B89),\"\",'Scoring criteria'!B89))","v":1},{"$f":"IF('Scoring criteria'!C89=\"NA\", -1,IF(ISBLANK('Scoring criteria'!C89),\"\",'Scoring criteria'!C89))","v":1},{"$f":"IF('Scoring criteria'!D89=\"NA\", -1,IF(ISBLANK('Scoring criteria'!D89),\"\",'Scoring criteria'!D89))","v":""},0,1,0,0,0]
[{"$f":"IF('Scoring criteria'!B90=\"NA\", -1,IF(ISBLANK('Scoring criteria'!B90),\"\",'Scoring criteria'!B90))","v":0},{"$f":"IF('Scoring criteria'!C90=\"NA\", -1,IF(ISBLANK('Scoring criteria'!C90),\"\",'Scoring criteria'!C90))","v":0},{"$f":"IF('Scoring criteria'!D90=\"NA\", -1,IF(ISBLANK('Scoring criteria'!D90),\"\",'Scoring criteria'!D90))","v":""},0,1,0,0,0]
[{"$f":"IF('Scoring criteria'!B91=\"NA\", -1,IF(ISBLANK('Scoring criteria'!B91),\"\",'Scoring criteria'!B91))","v":-1},{"$f":"IF('Scoring criteria'!C91=\"NA\", -1,IF(ISBLANK('Scoring criteria'!C91),\"\",'Scoring criteria'!C91))","v":-1},{"$f":"IF('Scoring criteria'!D91=\"NA\", -1,IF(ISBLANK('Scoring criteria'!D91),\"\",'Scoring criteria'!D91))","v":""},0,1,0,0,0]
[{"$f":"IF('Scoring criteria'!B92=\"NA\", -1,IF(ISBLANK('Scoring criteria'!B92),\"\",'Scoring criteria'!B92))","v":-1},{"$f":"IF('Scoring criteria'!C92=\"NA\", -1,IF(ISBLANK('Scoring criteria'!C92),\"\",'Scoring criteria'!C92))","v":-1},{"$f":"IF('Scoring criteria'!D92=\"NA\", -1,IF(ISBLANK('Scoring criteria'!D92),\"\",'Scoring criteria'!D92))","v":""},0,1,0,0,0]
[{"$f":"IF('Scoring criteria'!B93=\"NA\", -1,IF(ISBLANK('Scoring criteria'!B93),\"\",'Scoring criteria'!B93))","v":-1},{"$f":"IF('Scoring criteria'!C93=\"NA\", -1,IF(ISBLANK('Scoring criteria'!C93),\"\",'Scoring criteria'!C93))","v":-1},{"$f":"IF('Scoring criteria'!D93=\"NA\", -1,IF(ISBLANK('Scoring criteria'!D93),\"\",'Scoring criteria'!D93))","v":""},0,1,0,0,0]
[{"$f":"IF('Scoring criteria'!B94=\"NA\", -1,IF(ISBLANK('Scoring criteria'!B94),\"\",'Scoring criteria'!B94))","v":-1},{"$f":"IF('Scoring criteria'!C94=\"NA\", -1,IF(ISBLANK('Scoring criteria'!C94),\"\",'Scoring criteria'!C94))","v":-1},{"$f":"IF('Scoring criteria'!D94=\"NA\", -1,IF(ISBLANK('Scoring criteria'!D94),\"\",'Scoring criteria'!D94))","v":""},0,1,0,0,0]
[{"$f":"IF('Scoring criteria'!B100=\"NA\", -1,IF(ISBLANK('Scoring criteria'!B100),\"\",'Scoring criteria'!B100))","v":3},{"$f":"IF('Scoring criteria'!C100=\"NA\", -1,IF(ISBLANK('Scoring criteria'!C100),\"\",'Scoring criteria'!C100))","v":3},{"$f":"IF('Scoring criteria'!D100=\"NA\", -1,IF(ISBLANK('Scoring criteria'!D100),\"\",'Scoring criteria'!D100))","v":""},0,1,0,0,0]
[{"$f":"IF('Scoring criteria'!B101=\"NA\", -1,IF(ISBLANK('Scoring criteria'!B101),\"\",'Scoring criteria'!B101))","v":0},{"$f":"IF('Scoring criteria'!C101=\"NA\", -1,IF(ISBLANK('Scoring criteria'!C101),\"\",'Scoring criteria'!C101))","v":0},{"$f":"IF('Scoring criteria'!D101=\"NA\", -1,IF(ISBLANK('Scoring criteria'!D101),\"\",'Scoring criteria'!D101))","v":""},0,1,0,0,0]
[{"$f":"IF('Scoring criteria'!B102=\"NA\", -1,IF(ISBLANK('Scoring criteria'!B102),\"\",'Scoring criteria'!B102))","v":1},{"$f":"IF('Scoring criteria'!C102=\"NA\", -1,IF(ISBLANK('Scoring criteria'!C102),\"\",'Scoring criteria'!C102))","v":1},{"$f":"IF('Scoring criteria'!D102=\"NA\", -1,IF(ISBLANK('Scoring criteria'!D102),\"\",'Scoring criteria'!D102))","v":""},0,1,0,0,0]
[{"$f":"IF('Scoring criteria'!B103=\"NA\", -1,IF(ISBLANK('Scoring criteria'!B103),\"\",'Scoring criteria'!B103))","v":0},{"$f":"IF('Scoring criteria'!C103=\"NA\", -1,IF(ISBLANK('Scoring criteria'!C103),\"\",'Scoring criteria'!C103))","v":0},{"$f":"IF('Scoring criteria'!D103=\"NA\", -1,IF(ISBLANK('Scoring criteria'!D103),\"\",'Scoring criteria'!D103))","v":""},0,1,0,0,0]
[{"$f":"IF('Scoring criteria'!B104=\"NA\", -1,IF(ISBLANK('Scoring criteria'!B104),\"\",'Scoring criteria'!B104))","v":0},{"$f":"IF('Scoring criteria'!C104=\"NA\", -1,IF(ISBLANK('Scoring criteria'!C104),\"\",'Scoring criteria'!C104))","v":2},{"$f":"IF('Scoring criteria'!D104=\"NA\", -1,IF(ISBLANK('Scoring criteria'!D104),\"\",'Scoring criteria'!D104))","v":""},1.4142135623730951,0,0,0,1]
[{"$f":"IF('Scoring criteria'!B105=\"NA\", -1,IF(ISBLANK('Scoring criteria'!B105),\"\",'Scoring criteria'!B105))","v":3},{"$f":"IF('Scoring criteria'!C105=\"NA\", -1,IF(ISBLANK('Scoring criteria'!C105),\"\",'Scoring criteria'!C105))","v":3},{"$f":"IF('Scoring criteria'!D105=\"NA\", -1,IF(ISBLANK('Scoring criteria'!D105),\"\",'Scoring criteria'!D105))","v":""},0,1,0,0,0]
[{"$f":"IF('Scoring criteria'!B106=\"NA\", -1,IF(ISBLANK('Scoring criteria'!B106),\"\",'Scoring criteria'!B106))","v":0},{"$f":"IF('Scoring criteria'!C106=\"NA\", -1,IF(ISBLANK('Scoring criteria'!C106),\"\",'Scoring criteria'!C106))","v":0},{"$f":"IF('Scoring criteria'!D106=\"NA\", -1,IF(ISBLANK('Scoring criteria'!D106),\"\",'Scoring criteria'!D106))","v":""},0,1,0,0,0]
[{"$f":"IF('Scoring criteria'!B112=\"NA\", -1,IF(ISBLANK('Scoring criteria'!B112),\"\",'Scoring criteria'!B112))","v":1},{"$f":"IF('Scoring criteria'!C112=\"NA\", -1,IF(ISBLANK('Scoring criteria'!C112),\"\",'Scoring criteria'!C112))","v":1},{"$f":"IF('Scoring criteria'!D112=\"NA\", -1,IF(ISBLANK('Scoring criteria'!D112),\"\",'Scoring criteria'!D112))","v":""},0,1,0,0,0]
[{"$f":"IF('Scoring criteria'!B113=\"NA\", -1,IF(ISBLANK('Scoring criteria'!B113),\"\",'Scoring criteria'!B113))","v":1},{"$f":"IF('Scoring criteria'!C113=\"NA\", -1,IF(ISBLANK('Scoring criteria'!C113),\"\",'Scoring criteria'!C113))","v":1},{"$f":"IF('Scoring criteria'!D113=\"NA\", -1,IF(ISBLANK('Scoring criteria'!D113),\"\",'Scoring criteria'!D113))","v":""},0,1,0,0,0]
[{"$f":"IF('Scoring criteria'!B114=\"NA\", -1,IF(ISBLANK('Scoring criteria'!B114),\"\",'Scoring criteria'!B114))","v":3},{"$f":"IF('Scoring criteria'!C114=\"NA\", -1,IF(ISBLANK('Scoring criteria'!C114),\"\",'Scoring criteria'!C114))","v":2},{"$f":"IF('Scoring criteria'!D114=\"NA\", -1,IF(ISBLANK('Scoring criteria'!D114),\"\",'Scoring criteria'!D114))","v":""},0.70710678118654757,{"$f":"IF(D67=0,1,0)","v":0},{"$f":"IF(AND(0<D67, D67<0.6),1,0)","v":0},{"$f":"IF(AND(0.6<=D67,D67<=1),1,0)","v":1},{"$f":"IF(D67>1,1,0)","v":0}]
[{"$f":"IF('Scoring criteria'!B115=\"NA\", -1,IF(ISBLANK('Scoring criteria'!B115),\"\",'Scoring criteria'!B115))","v":0},{"$f":"IF('Scoring criteria'!C115=\"NA\", -1,IF(ISBLANK('Scoring criteria'!C115),\"\",'Scoring criteria'!C115))","v":0},{"$f":"IF('Scoring criteria'!D115=\"NA\", -1,IF(ISBLANK('Scoring criteria'!D115),\"\",'Scoring criteria'!D115))","v":""},{"$f":"IF(AND(A68=-1,B68=-1,C68=-1),0,STDEV(A68,B68,C68))","v":0},1,0,0,0]
[{"$f":"IF('Scoring criteria'!B116=\"NA\", -1,IF(ISBLANK('Scoring criteria'!B116),\"\",'Scoring criteria'!B116))","v":1},{"$f":"IF('Scoring criteria'!C116=\"NA\", -1,IF(ISBLANK('Scoring criteria'!C116),\"\",'Scoring criteria'!C116))","v":1},{"$f":"IF('Scoring criteria'!D116=\"NA\", -1,IF(ISBLANK('Scoring criteria'!D116),\"\",'Scoring criteria'!D116))","v":""},0,1,0,0,0]
[{"$f":"IF('Scoring criteria'!B122=\"NA\", -1,IF(ISBLANK('Scoring criteria'!B122),\"\",'Scoring criteria'!B122))","v":0},{"$f":"IF('Scoring criteria'!C122=\"NA\", -1,IF(ISBLANK('Scoring criteria'!C122),\"\",'Scoring criteria'!C122))","v":0},{"$f":"IF('Scoring criteria'!D122=\"NA\", -1,IF(ISBLANK('Scoring criteria'!D122),\"\",'Scoring criteria'!D122))","v":""},0,1,0,0,0]
[{"$f":"IF('Scoring criteria'!B123=\"NA\", -1,IF(ISBLANK('Scoring criteria'!B123),\"\",'Scoring criteria'!B123))","v":3},{"$f":"IF('Scoring criteria'!C123=\"NA\", -1,IF(ISBLANK('Scoring criteria'!C123),\"\",'Scoring criteria'!C123))","v":3},{"$f":"IF('Scoring criteria'!D123=\"NA\", -1,IF(ISBLANK('Scoring criteria'!D123),\"\",'Scoring criteria'!D123))","v":""},0,1,0,0,0]
[{"$f":"IF('Scoring criteria'!B124=\"NA\", -1,IF(ISBLANK('Scoring criteria'!B124),\"\",'Scoring criteria'!B124))","v":3},{"$f":"IF('Scoring criteria'!C124=\"NA\", -1,IF(ISBLANK('Scoring criteria'!C124),\"\",'Scoring criteria'!C124))","v":0},{"$f":"IF('Scoring criteria'!D124=\"NA\", -1,IF(ISBLANK('Scoring criteria'!D124),\"\",'Scoring criteria'!D124))","v":""},2.1213203435596424,0,0,0,1]
[{"$f":"IF('Scoring criteria'!B125=\"NA\", -1,IF(ISBLANK('Scoring criteria'!B125),\"\",'Scoring criteria'!B125))","v":3},{"$f":"IF('Scoring criteria'!C125=\"NA\", -1,IF(ISBLANK('Scoring criteria'!C125),\"\",'Scoring criteria'!C125))","v":3},{"$f":"IF('Scoring criteria'!D125=\"NA\", -1,IF(ISBLANK('Scoring criteria'!D125),\"\",'Scoring criteria'!D125))","v":""},0,1,0,0,0]
[{"$f":"IF('Scoring criteria'!B126=\"NA\", -1,IF(ISBLANK('Scoring criteria'!B126),\"\",'Scoring criteria'!B126))","v":3},{"$f":"IF('Scoring criteria'!C126=\"NA\", -1,IF(ISBLANK('Scoring criteria'!C126),\"\",'Scoring criteria'!C126))","v":3},{"$f":"IF('Scoring criteria'!D126=\"NA\", -1,IF(ISBLANK('Scoring criteria'!D126),\"\",'Scoring criteria'!D126))","v":""},0,1,0,0,0]
[{"$f":"IF('Scoring criteria'!B127=\"NA\", -1,IF(ISBLANK('Scoring criteria'!B127),\"\",'Scoring criteria'!B127))","v":3},{"$f":"IF('Scoring criteria'!C127=\"NA\", -1,IF(ISBLANK('Scoring criteria'!C127),\"\",'Scoring criteria'!C127))","v":3},{"$f":"IF('Scoring criteria'!D127=\"NA\", -1,IF(ISBLANK('Scoring criteria'!D127),\"\",'Scoring criteria'!D127))","v":""},0,1,0,0,0]
[{"$f":"IF('Scoring criteria'!B128=\"NA\", -1,IF(ISBLANK('Scoring criteria'!B128),\"\",'Scoring criteria'!B128))","v":0},{"$f":"IF('Scoring criteria'!C128=\"NA\", -1,IF(ISBLANK('Scoring criteria'!C128),\"\",'Scoring criteria'!C128))","v":0},{"$f":"IF('Scoring criteria'!D128=\"NA\", -1,IF(ISBLANK('Scoring criteria'!D128),\"\",'Scoring criteria'!D128))","v":""},0,1,0,0,0]
[{"$f":"IF('Scoring criteria'!B134=\"NA\", -1,IF(ISBLANK('Scoring criteria'!B134),\"\",'Scoring criteria'!B134))","v":0},{"$f":"IF('Scoring criteria'!C134=\"NA\", -1,IF(ISBLANK('Scoring criteria'!C134),\"\",'Scoring criteria'!C134))","v":0},{"$f":"IF('Scoring criteria'!D134=\"NA\", -1,IF(ISBLANK('Scoring criteria'!D134),\"\",'Scoring criteria'!D134))","v":""},0,1,0,0,0]
[{"$f":"IF('Scoring criteria'!B135=\"NA\", -1,IF(ISBLANK('Scoring criteria'!B135),\"\",'Scoring criteria'!B135))","v":-1},{"$f":"IF('Scoring criteria'!C135=\"NA\", -1,IF(ISBLANK('Scoring criteria'!C135),\"\",'Scoring criteria'!C135))","v":0},{"$f":"IF('Scoring criteria'!D135=\"NA\", -1,IF(ISBLANK('Scoring criteria'!D135),\"\",'Scoring criteria'!D135))","v":""},0.70710678118654757,0,0,1,0]
[{"$f":"IF('Scoring criteria'!B136=\"NA\", -1,IF(ISBLANK('Scoring criteria'!B136),\"\",'Scoring criteria'!B136))","v":1},{"$f":"IF('Scoring criteria'!C136=\"NA\", -1,IF(ISBLANK('Scoring criteria'!C136),\"\",'Scoring criteria'!C136))","v":1},{"$f":"IF('Scoring criteria'!D136=\"NA\", -1,IF(ISBLANK('Scoring criteria'!D136),\"\",'Scoring criteria'!D136))","v":""},0,1,0,0,0]
[{"$f":"IF('Scoring criteria'!B137=\"NA\", -1,IF(ISBLANK('Scoring criteria'!B137),\"\",'Scoring criteria'!B137))","v":1},{"$f":"IF('Scoring criteria'!C137=\"NA\", -1,IF(ISBLANK('Scoring criteria'!C137),\"\",'Scoring criteria'!C137))","v":1},{"$f":"IF('Scoring criteria'!D137=\"NA\", -1,IF(ISBLANK('Scoring criteria'!D137),\"\",'Scoring criteria'!D137))","v":""},0,1,0,0,0]
[null,null,null,"total",{"$f":"SUM(E3:E80)","v":63},{"$f":"SUM(F3:F80)","v":1},{"$f":"SUM(G3:G80)","v":7},{"$f":"SUM(H3:H80)","v":7}]